{
    "nodes" :
    [
        {
            "id" : 0,
            "message" : "*snif* *snif* Good day... *sniff* You wouldnt happen to be a mighty hero, would you? *sniff*",
            "speaker" : "npc",
            "neighbours" : [1,2]
        },
        {
            "id" : 1,
            "message" : "QUEST",
            "speaker" : "player",
            "neighbours" : [3]
        },
        {
            "id" : 2,
            "message" : "Leave",
            "speaker" : "player",
            "neighbours" : [9]
        },
        {
            "id" : 3,
            "message" : "As a matter of fact I am a mighty hero! Or I aspire to be... Do you need help with something?",
            "speaker" : "player",
            "neighbours" : [4]
        },
        {
            "id" : 4,
            "message" : "Oh really? *sniff* You would help me? Thank you so much! *smooch* Those nasty monsters up ahead ate my sweetroll :( I was really looknig forward to eating it :'( Could you be so nice and avange me? I was thinking maybe you could murder them in cold blood - that could really ruin their day, I think...",
            "speaker" : "npc",
            "neighbours" : [5]
        },
        {
            "id" : 5,
            "message" : "YOU THINK??!!",
            "speaker" : "player",
            "neighbours" : [6]
        },
        {
            "id" : 6,
            "message" : "Yeah... Go on now, you. And kill at least 10 of them! That seems fair, a sweetroll for 10 lives, yes...",
            "speaker" : "npc",
            "neighbours" : [7]
        },
        {
            "id" : 7,
            "message" : "Hm, okay. Oh boy, here I go killing again.",
            "speaker" : "player",
            "neighbours" : [8]
        },
        {
            "id" : 8,
            "message" : "Alright, now back to being sad... *sniff* Bye, bye. *sniff*",
            "speaker" : "npc",
            "neighbours" : []
        },
        {
            "id" : 9,
            "message" : "Ehm... No...",
            "speaker" : "player",
            "neighbours" : [8]
        }
    ]
}