%YAML 1.1
%TAG !u! tag:unity3d.com,2011:
--- !u!114 &11400000
MonoBehaviour:
  m_ObjectHideFlags: 0
  m_CorrespondingSourceObject: {fileID: 0}
  m_PrefabInstance: {fileID: 0}
  m_PrefabAsset: {fileID: 0}
  m_GameObject: {fileID: 0}
  m_Enabled: 1
  m_EditorHideFlags: 0
  m_Script: {fileID: 11500000, guid: 6821e2e8fc9631647a6b573e7b88d901, type: 3}
  m_Name: RareFlowers
  m_EditorClassIdentifier: 
  isActive: 0
  title: Rare flowers
  description: The young lad needs you find the rare flowers - Radikalia Richrovia.
    Look for them in the Wastelands.
  expReward: 50
  goldReward: 400
  itemReward: {fileID: 11400000, guid: 506cc6119ec6fa74f9b57958ae36a528, type: 2}
  requiredAmount: 5
  currentAmount: 0
  finished: 0
  questItem: {fileID: 11400000, guid: abf7c07a5e185d947abb12af184283e4, type: 2}
