{
    "messages" : ["No attacks recently, all good for now.",
                   "I heard something over there...",
                   "This day never ends.",
                   "I'm hungry already...",
                   "I feel a new citizen here."]
}