%YAML 1.1
%TAG !u! tag:unity3d.com,2011:
--- !u!114 &11400000
MonoBehaviour:
  m_ObjectHideFlags: 0
  m_CorrespondingSourceObject: {fileID: 0}
  m_PrefabInstance: {fileID: 0}
  m_PrefabAsset: {fileID: 0}
  m_GameObject: {fileID: 0}
  m_Enabled: 1
  m_EditorHideFlags: 0
  m_Script: {fileID: 11500000, guid: c0a41b52cebbdfc49a9d434f9ee7ec89, type: 3}
  m_Name: Sweetroll
  m_EditorClassIdentifier: 
  isActive: 0
  title: Swetroll revenge
  description: Kill at least 10 Imps to avange the crying lady
  expReward: 50
  goldReward: 10
  itemReward: {fileID: 11400000, guid: 85791095ee61376408b75152cef46cfa, type: 2}
  requiredAmount: 10
  currentAmount: 0
  finished: 0
  monsterType: 1
