%YAML 1.1
%TAG !u! tag:unity3d.com,2011:
--- !u!1001 &2050941720245420903
PrefabInstance:
  m_ObjectHideFlags: 0
  serializedVersion: 2
  m_Modification:
    m_TransformParent: {fileID: 0}
    m_Modifications:
    - target: {fileID: 1687792525792312, guid: 566814b1eb74baa449f9fef747a83fd1, type: 3}
      propertyPath: m_Name
      value: SM_Tree_Pine_Large_02_Snow
      objectReference: {fileID: 0}
    - target: {fileID: 4024179324343364, guid: 566814b1eb74baa449f9fef747a83fd1, type: 3}
      propertyPath: m_LocalPosition.x
      value: 45.21
      objectReference: {fileID: 0}
    - target: {fileID: 4024179324343364, guid: 566814b1eb74baa449f9fef747a83fd1, type: 3}
      propertyPath: m_LocalPosition.y
      value: 0
      objectReference: {fileID: 0}
    - target: {fileID: 4024179324343364, guid: 566814b1eb74baa449f9fef747a83fd1, type: 3}
      propertyPath: m_LocalPosition.z
      value: 0
      objectReference: {fileID: 0}
    - target: {fileID: 4024179324343364, guid: 566814b1eb74baa449f9fef747a83fd1, type: 3}
      propertyPath: m_LocalRotation.x
      value: 0
      objectReference: {fileID: 0}
    - target: {fileID: 4024179324343364, guid: 566814b1eb74baa449f9fef747a83fd1, type: 3}
      propertyPath: m_LocalRotation.y
      value: 0
      objectReference: {fileID: 0}
    - target: {fileID: 4024179324343364, guid: 566814b1eb74baa449f9fef747a83fd1, type: 3}
      propertyPath: m_LocalRotation.z
      value: 0
      objectReference: {fileID: 0}
    - target: {fileID: 4024179324343364, guid: 566814b1eb74baa449f9fef747a83fd1, type: 3}
      propertyPath: m_LocalRotation.w
      value: 1
      objectReference: {fileID: 0}
    - target: {fileID: 4024179324343364, guid: 566814b1eb74baa449f9fef747a83fd1, type: 3}
      propertyPath: m_RootOrder
      value: 0
      objectReference: {fileID: 0}
    - target: {fileID: 4024179324343364, guid: 566814b1eb74baa449f9fef747a83fd1, type: 3}
      propertyPath: m_LocalEulerAnglesHint.x
      value: 0
      objectReference: {fileID: 0}
    - target: {fileID: 4024179324343364, guid: 566814b1eb74baa449f9fef747a83fd1, type: 3}
      propertyPath: m_LocalEulerAnglesHint.y
      value: 0
      objectReference: {fileID: 0}
    - target: {fileID: 4024179324343364, guid: 566814b1eb74baa449f9fef747a83fd1, type: 3}
      propertyPath: m_LocalEulerAnglesHint.z
      value: 0
      objectReference: {fileID: 0}
    - target: {fileID: 23112616199425546, guid: 566814b1eb74baa449f9fef747a83fd1,
        type: 3}
      propertyPath: m_Materials.Array.data[1]
      value: 
      objectReference: {fileID: 2100000, guid: 484f68ebb25012b48b561c6a58eac81b, type: 2}
    - target: {fileID: 23112616199425546, guid: 566814b1eb74baa449f9fef747a83fd1,
        type: 3}
      propertyPath: m_Materials.Array.data[0]
      value: 
      objectReference: {fileID: 2100000, guid: 30896a7b182e164489ff84a9fae91802, type: 2}
    - target: {fileID: 23647242940061402, guid: 566814b1eb74baa449f9fef747a83fd1,
        type: 3}
      propertyPath: m_Materials.Array.data[0]
      value: 
      objectReference: {fileID: 2100000, guid: 20238a93bc24a994a91a72ed08436a3e, type: 2}
    m_RemovedComponents: []
  m_SourcePrefab: {fileID: 100100000, guid: 566814b1eb74baa449f9fef747a83fd1, type: 3}
