{
    "nodes" :
    [
        {
            "id" : 0,
            "message" : "Sup, dude? You here to chit-chat? *cough* Oh and thanks for finding the flowers for me, eventough I found out that they dont work, so...",
            "speaker" : "npc",
            "neighbours" : [2,3]
        },
        {
            "id" : 2,
            "message" : "Chit-chat",
            "speaker" : "player",
            "neighbours" : [16]
        },
        {
            "id" : 3,
            "message" : "Leave",
            "speaker" : "player",
            "neighbours" : [15]
        },
        {
            "id" : 15,
            "message" : "See ya, good luck on your journey. *cough*",
            "speaker" : "player",
            "neighbours" : []
        },
        {
            "id" : 16,
            "message" : "Okay, great, cos you wont believe what happend to me few days ago. So I'm in the forrest, right, just *cough* chillin, not much goin on.",
            "speaker" : "npc",
            "neighbours" : [17]
        },
        {
            "id" : 17,
            "message" : "Uh huh...",
            "speaker" : "player",
            "neighbours" : [18]
        },
        {
            "id" : 18,
            "message" : " And it was getting a little dark and I realized I havent had my first dinner yet, right, and then I see this funny looking black bird hanging from one of the trees upside down and... *cough* *cough*",
            "speaker" : "npc",
            "neighbours" : [19]
        },
        {
            "id" : 19,
            "message" : "...Ehm, I think that was a ba-",
            "speaker" : "player",
            "neighbours" : [20]
        },
        {
            "id" : 20,
            "message" : "...and so I take my slingshot and BAAAM, just like that, deaded, no problem and so I make myself a fire right, cos I wanted to cook that weird bird, as you do and...",
            "speaker" : "npc",
            "neighbours" : [21]
        },
        {
            "id" : 21,
            "message" : "Yeah, I, uh...",
            "speaker" : "player",
            "neighbours" : [22]
        },
        {
            "id" : 22,
            "message" : "...and so I'm there I am, chillin and grillin and then I realize that the bird doesnt have any feathers or a beek and I'm like what the hell dude *cough*, you know, but I ate it anyway, HA HA HAA HA... Birds, am right? Heh, heh... But I havent been feelin so good since then, I think I have a fever and my body hurts.",
            "speaker" : "npc",
            "neighbours" : [23]
        },
        {
            "id" : 23,
            "message" : "Yeah, uh, I think I'm gonna go, I gotta do a ... ehm... a ... a thing.",
            "speaker" : "player",
            "neighbours" : [24]
        },
        {
            "id" : 24,
            "message" : "Alright, great talk, man. *cough* *cough*",
            "speaker" : "npc",
            "neighbours" : [25]
        },
        {
            "id" : 25,
            "message" : "Sure.",
            "speaker" : "player",
            "neighbours" : [15]
        }
    ]
}