%YAML 1.1
%TAG !u! tag:unity3d.com,2011:
--- !u!114 &11400000
MonoBehaviour:
  m_ObjectHideFlags: 0
  m_CorrespondingSourceObject: {fileID: 0}
  m_PrefabInstance: {fileID: 0}
  m_PrefabAsset: {fileID: 0}
  m_GameObject: {fileID: 0}
  m_Enabled: 1
  m_EditorHideFlags: 0
  m_Script: {fileID: 11500000, guid: c0a41b52cebbdfc49a9d434f9ee7ec89, type: 3}
  m_Name: Murlocks
  m_EditorClassIdentifier: 
  isActive: 0
  title: Murlock Infestation
  description: Kill atleast 6 murlocks to free the route
  expReward: 60
  goldReward: 60
  itemReward: {fileID: 11400000, guid: d7fd5174cae7e2849812093adb378341, type: 2}
  requiredAmount: 6
  currentAmount: 0
  finished: 0
  monsterType: 3
