%YAML 1.1
%TAG !u! tag:unity3d.com,2011:
--- !u!114 &11400000
MonoBehaviour:
  m_ObjectHideFlags: 0
  m_CorrespondingSourceObject: {fileID: 0}
  m_PrefabInstance: {fileID: 0}
  m_PrefabAsset: {fileID: 0}
  m_GameObject: {fileID: 0}
  m_Enabled: 1
  m_EditorHideFlags: 0
  m_Script: {fileID: 11500000, guid: 24bab6ed2f1cda448b485e8577d1034f, type: 3}
  m_Name: questitem
  m_EditorClassIdentifier: 
  name: DO NOT DELETE
  icon: {fileID: 21300000, guid: 28d2c2677149d45e290e8fa042b1b80f, type: 3}
  drop_percentage: 100
