{
    "nodes": [
        {
            "id": 0,
            "message": "Salut!",
            "speaker": "npc",
            "neighbours": [ 1 ]
        },
        {
            "id": 1,
            "message": "Hello?",
            "speaker": "player",
            "neighbours": [ 2 ]
        },
        {
            "id": 2,
            "message": "There are rumors, that group of heroes is wandering nerby... are you one of them?",
            "speaker": "npc",
            "neighbours": [ 3 ]
        },
        {
            "id": 3,
            "message": "Well, yes. I am a hero!",
            "speaker": "player",
            "neighbours": [ 4 ]
        },
        {
            "id": 4,
            "message": "Perfect. So here is my contract: there are some strange... dog like creatures west from the city. Can you hunt them for gold?",
            "speaker": "npc",
            "neighbours": [ 5, 6 ]
        },
        {
            "id": 5,
            "message": "QUEST",
            "speaker": "player",
            "neighbours": [ 8 ]
        },
        {
            "id": 6,
            "message": "Leave",
            "speaker": "player",
            "neighbours": [ 7 ]
        },
        {
            "id": 7,
            "message": "Sorry. I have to go.",
            "speaker": "player",
            "neighbours": []
        },
        {
            "id": 8,
            "message": "Ok. I will take care of it.",
            "speaker": "player",
            "neighbours": []
        }
    ]
}