{
    "messages" : ["Don't cause any problems, outsider!",
                  "I've heard there is a big city \nsomewhere close by.", 
                  "I used to be an adventurer like you, \nbut then I... You know the rest...",
                  "*sigh*",
                  "You know what really grinds my gears?\nThe frickin goblins."]
}
