%YAML 1.1
%TAG !u! tag:unity3d.com,2011:
--- !u!1001 &2553341814231862657
PrefabInstance:
  m_ObjectHideFlags: 0
  serializedVersion: 2
  m_Modification:
    m_TransformParent: {fileID: 0}
    m_Modifications:
    - target: {fileID: 1182756067964316, guid: fc9f550802bde56499ac8b64cac565f0, type: 3}
      propertyPath: m_Name
      value: SM_Tree_Pine_01_Snow
      objectReference: {fileID: 0}
    - target: {fileID: 4724346807332270, guid: fc9f550802bde56499ac8b64cac565f0, type: 3}
      propertyPath: m_LocalPosition.x
      value: 39.35
      objectReference: {fileID: 0}
    - target: {fileID: 4724346807332270, guid: fc9f550802bde56499ac8b64cac565f0, type: 3}
      propertyPath: m_LocalPosition.y
      value: 0
      objectReference: {fileID: 0}
    - target: {fileID: 4724346807332270, guid: fc9f550802bde56499ac8b64cac565f0, type: 3}
      propertyPath: m_LocalPosition.z
      value: 0
      objectReference: {fileID: 0}
    - target: {fileID: 4724346807332270, guid: fc9f550802bde56499ac8b64cac565f0, type: 3}
      propertyPath: m_LocalRotation.x
      value: 0
      objectReference: {fileID: 0}
    - target: {fileID: 4724346807332270, guid: fc9f550802bde56499ac8b64cac565f0, type: 3}
      propertyPath: m_LocalRotation.y
      value: 0
      objectReference: {fileID: 0}
    - target: {fileID: 4724346807332270, guid: fc9f550802bde56499ac8b64cac565f0, type: 3}
      propertyPath: m_LocalRotation.z
      value: 0
      objectReference: {fileID: 0}
    - target: {fileID: 4724346807332270, guid: fc9f550802bde56499ac8b64cac565f0, type: 3}
      propertyPath: m_LocalRotation.w
      value: 1
      objectReference: {fileID: 0}
    - target: {fileID: 4724346807332270, guid: fc9f550802bde56499ac8b64cac565f0, type: 3}
      propertyPath: m_RootOrder
      value: 0
      objectReference: {fileID: 0}
    - target: {fileID: 4724346807332270, guid: fc9f550802bde56499ac8b64cac565f0, type: 3}
      propertyPath: m_LocalEulerAnglesHint.x
      value: 0
      objectReference: {fileID: 0}
    - target: {fileID: 4724346807332270, guid: fc9f550802bde56499ac8b64cac565f0, type: 3}
      propertyPath: m_LocalEulerAnglesHint.y
      value: 0
      objectReference: {fileID: 0}
    - target: {fileID: 4724346807332270, guid: fc9f550802bde56499ac8b64cac565f0, type: 3}
      propertyPath: m_LocalEulerAnglesHint.z
      value: 0
      objectReference: {fileID: 0}
    - target: {fileID: 23171540964131236, guid: fc9f550802bde56499ac8b64cac565f0,
        type: 3}
      propertyPath: m_Materials.Array.data[1]
      value: 
      objectReference: {fileID: 2100000, guid: 20238a93bc24a994a91a72ed08436a3e, type: 2}
    - target: {fileID: 23694049802177168, guid: fc9f550802bde56499ac8b64cac565f0,
        type: 3}
      propertyPath: m_Materials.Array.data[1]
      value: 
      objectReference: {fileID: 2100000, guid: 484f68ebb25012b48b561c6a58eac81b, type: 2}
    - target: {fileID: 23694049802177168, guid: fc9f550802bde56499ac8b64cac565f0,
        type: 3}
      propertyPath: m_Materials.Array.data[0]
      value: 
      objectReference: {fileID: 2100000, guid: 30896a7b182e164489ff84a9fae91802, type: 2}
    m_RemovedComponents: []
  m_SourcePrefab: {fileID: 100100000, guid: fc9f550802bde56499ac8b64cac565f0, type: 3}
