{
    "nodes" :
    [
        {
            "id" : 0,
            "message" : "Thank you again for killing the murlocks, that were eating my fishies.",
            "speaker" : "npc",
            "neighbours": []
        }
    ]
}