{
    "nodes": [
        {
            "id": 0,
            "message": "Hey. How is the fishing going?",
            "speaker": "player",
            "neighbours": [ 1 ]
        },
        {
            "id": 1,
            "message": "Its not good. I suspect there is something going on. Maybe you could help me?",
            "speaker": "npc",
            "neighbours": [ 2, 3 ]
        },
        {
            "id": 2,
            "message": "QUEST",
            "speaker": "player",
            "neighbours": [ 5 ]
        },
        {
            "id": 3,
            "message": "Leave",
            "speaker": "player",
            "neighbours": [ 4 ]
        },
        {
            "id": 4,
            "message": "Sorry, I have to go now.",
            "speaker": "player",
            "neighbours": []
        },
        {
            "id": 5,
            "message": "I overheard guards talking about some monsters wandering around the strand of the river.",
            "speaker": "npc",
            "neighbours": [ 6 ]
        },
        {
            "id": 6,
            "message": "Could you maybe check it out?",
            "speaker": "npc",
            "neighbours": [ 7 ]
        },
        {
            "id": 7,
            "message": "Sure, but what can you give me in return?",
            "speaker": "player",
            "neighbours": [ 8 ]
        },
        {
            "id": 8,
            "message": "Well I am poor fisherman. I can offer you my new special boots. They are called Gumaky!",
            "speaker": "npc",
            "neighbours": [ 9 ]
        },
        {
            "id": 9,
            "message": "Fine. I will see what I can do.",
            "speaker": "player",
            "neighbours": []
        }
    ]
}