{
    "nodes" :
    [
        {
            "id" : 0,
            "message" : "Hello there, general Ke- I mean adventurer! What brings you here today?",
            "speaker" : "npc",
            "neighbours" : [1,2,3]
        },
        {
            "id" : 1,
            "message" : "QUEST",
            "speaker" : "player",
            "neighbours" : [4]
        },
        {
            "id" : 2,
            "message" : "Buy/Sell",
            "speaker" : "player",
            "neighbours" : [8]
        },
        {
            "id" : 3,
            "message" : "Leave",
            "speaker" : "player",
            "neighbours" : [9]
        },
        {
            "id" : 4,
            "message" : "Oh, looking for work, are we? I have the perfect job just for you! Yesterday I went for a walk and I lost my basket. Could you please find it? I must have lost it somewhere around the waterfall.",
            "speaker" : "npc",
            "neighbours" : [5]
        },
        {
            "id" : 5,
            "message" : "I was expecting something a little more exciting, bur sure, I will try to find it...",
            "speaker" : "player",
            "neighbours" : [6]
        },
        {
            "id" : 6,
            "message" : "Thank you so much! As I said, it has to be somewhere by the big waterfall...",
            "speaker" : "npc",
            "neighbours" : [7]
        },
        {
            "id" : 7,
            "message" : "No problem. Bye now.",
            "speaker" : "player",
            "neighbours" : [9]
        },
        {
            "id" : 8,
            "message" : "So you want to buy something from a merchant, huh? Yeah well let me be straight with you... You can't. I'm not sure why, those guys said somethign about \"this only being an aplha version of the game\", or whatever, I dont know... Sorry :(",
            "speaker" : "npc",
            "neighbours" : [10]
        },
        {
            "id" : 10,
            "message" : "That's totally understandable. I bet those guys know, what they are talking about. After all, they are as smart as they are beautiful and talented, so no worries.",
            "speaker" : "player",
            "neighbours" : [11]
        },
        {
            "id" : 11,
            "message" : "Thank you for understanding.",
            "speaker" : "npc",
            "neighbours" : [7]
        },
        {
            "id" : 9,
            "message" : "Alrighty then, see you around.",
            "speaker" : "npc",
            "neighbours" : []
        }
    ]
}