%YAML 1.1
%TAG !u! tag:unity3d.com,2011:
--- !u!114 &11400000
MonoBehaviour:
  m_ObjectHideFlags: 0
  m_CorrespondingSourceObject: {fileID: 0}
  m_PrefabInstance: {fileID: 0}
  m_PrefabAsset: {fileID: 0}
  m_GameObject: {fileID: 0}
  m_Enabled: 1
  m_EditorHideFlags: 0
  m_Script: {fileID: 11500000, guid: c0a41b52cebbdfc49a9d434f9ee7ec89, type: 3}
  m_Name: Werewolf
  m_EditorClassIdentifier: 
  isActive: 0
  title: Look mum, I'm a witcher!
  description: The local has a problem with werewolfs. Find them in the norhern part
    of the city and kill them!
  expReward: 100
  goldReward: 100
  itemReward: {fileID: 11400000, guid: 8c6773f9fa573924d809921676f69464, type: 2}
  requiredAmount: 3
  currentAmount: 0
  finished: 0
  monsterType: 2
