%YAML 1.1
%TAG !u! tag:unity3d.com,2011:
--- !u!1045 &1
EditorBuildSettings:
  m_ObjectHideFlags: 0
  serializedVersion: 2
  m_Scenes:
  - enabled: 1
    path: Assets/Scenes/MainMenu.unity
    guid: 264c2ea42e7d9b446aa9b086f7cf2a54
  - enabled: 1
    path: Assets/Scenes/Devroom.unity
    guid: 1eb07e8e7c7f81e4b944246ed934339c
  - enabled: 1
    path: Assets/Scenes/MountainsTest.unity
    guid: 839cf439b67637b4e9a1719bc4fd219c
  - enabled: 1
    path: Assets/Scenes/city2.unity
    guid: f1d9f7d14c754624f9d383de51c8e976
  - enabled: 1
    path: Assets/Scenes/Plains.unity
    guid: eaa50538f3f523740ad52dd3a2155d43
  - enabled: 1
    path: Assets/Scenes/WastelandTest.unity
    guid: 4f0924cb1bb2be74e9e671548998ef6e
  - enabled: 0
    path: 
    guid: 00000000000000000000000000000000
  m_configObjects: {}
