{
    "nodes" :
    [
        {
            "id" : 0,
            "message" : "You are my life saver. Because of you I can reopen my shop!",
            "speaker" : "npc",
            "neighbours" : []
        }
    ]
}