{
    "nodes" :
    [
        {
            "id" : 0,
            "message" : "Oh hey, it's you again. Did you talk to her yet?",
            "speaker" : "npc",
            "neighbours" : [1,2]
        },
        {
            "id" : 1,
            "message" : "Busy",
            "speaker" : "player",
            "neighbours" : [3]
        },
        {
            "id" : 2,
            "message" : "Leave",
            "speaker" : "player",
            "neighbours" : []
        },
        {
            "id" : 3,
            "message" : "Alright alright, I'm working on it. Do not worry.",
            "speaker" : "player",
            "neighbours" : [2]
        },
        {
            "id" : 4,
            "message" : "Thanks, sorry I'm just worried she will forget me after such a long time apart. I've been here for 6 MONTHS already. I might be going crazy.. hahahah.",
            "speaker" : "npc",
            "neighbours" : []
        }
    ]
}