{
    "nodes" :
    [
        {
            "id" : 0,
            "message" : "Oh hey, it's you again. Did you already killed those monsters in forest?",
            "speaker" : "npc",
            "neighbours" : [1]
        },
        {
            "id" : 1,
            "message" : "No, not yet.",
            "speaker" : "player",
            "neighbours" : []
        }
    ]
}