%YAML 1.1
%TAG !u! tag:unity3d.com,2011:
--- !u!114 &11400000
MonoBehaviour:
  m_ObjectHideFlags: 0
  m_CorrespondingSourceObject: {fileID: 0}
  m_PrefabInstance: {fileID: 0}
  m_PrefabAsset: {fileID: 0}
  m_GameObject: {fileID: 0}
  m_Enabled: 1
  m_EditorHideFlags: 0
  m_Script: {fileID: 11500000, guid: cd22b630d98a62641aeaa70ac6e4cc01, type: 3}
  m_Name: TraderActive
  m_EditorClassIdentifier: 
  jsonFile: {fileID: 4900000, guid: dbd7cf0b548e92d48bf6407dc460e1c1, type: 3}
  npcName: Alan the Trader
