{
    "nodes" :
    [
        {
            "id" : 0,
            "message" : "Hey, you! Yeah, you've got a moment? I have a favor to ask.",
            "speaker" : "npc",
            "neighbours" : [1,2,3]
        },
        {
            "id" : 1,
            "message" : "QUEST",
            "speaker" : "player",
            "neighbours" : [4]
        },
        {
            "id" : 2,
            "message" : "No time",
            "speaker" : "player",
            "neighbours" : [19]
        },
        {
            "id" : 3,
            "message" : "Leave",
            "speaker" : "player",
            "neighbours" : []
        },
        {
            "id" : 4,
            "message" : "I guess I have some spare time, what is the matter?",
            "speaker" : "player",
            "neighbours" : [5]
        },
        {
            "id" : 5,
            "message" : "We've been on patrol here for ages, I don't even remember the last time talking to my girl up there in the village!",
            "speaker" : "npc",
            "neighbours" : [6]
        },
        {
            "id" : 6,
            "message" : "There is an actual village here? I thought the monsters took over everything...or that the devs didn't finish it or something.",
            "speaker" : "player",
            "neighbours" : [7]
        },
        {
            "id" : 7,
            "message" : "Back to the topic! Yes the goddamn monsters, that's the reason why we are here. And the reason why we can't go back to our families right now. My wife must be curious and scared for me, or at least I hope so haha.",
            "speaker" : "npc",
            "neighbours" : [8]
        },
        {
            "id" : 8,
            "message" : "Let me guess, you want me to bring her something?",
            "speaker" : "player",
            "neighbours" : [9]
        },
        {
            "id" : 9,
            "message" : "I want to hear a word from her actually, pretty please. I will reward you with gold! Literally, but I don't have much... so maybe something from my equipment would be nice eh?",
            "speaker" : "npc",
            "neighbours" : [10]
        },
        {
            "id" : 10,
            "message" : "I really like that fancy helmet of yours...",
            "speaker" : "player",
            "neighbours" : [11]
        },
        {
            "id" : 11,
            "message" : "ANYTHING but that fancy helmet! Or whatever, I will give it to you, if you can get me a letter from her! She needs to know I'm alive, I cannot keep on worrying her. You will find her in no time, she is from the family of flower lovers. Her name is Mary. And she wears this red flowery dress, ah I love it!",
            "speaker" : "npc",
            "neighbours" : [12]
        },
        {
            "id" : 12,
            "message" : "Do you wanna know the way to the village? Or are you brave enough to find the way on your own?",
            "speaker" : "npc",
            "neighbours" : [13,14]
        },      
        {
            "id" : 13,
            "message" : "Wanna know",
            "speaker" : "player",
            "neighbours" : [15]
        },
        {
            "id" : 14,
            "message" : "I'll find",
            "speaker" : "player",
            "neighbours" : [16]
        },
        {
            "id" : 15,
            "message" : "Okay it's super easy. You go down this road, then take the left path, there's a bridge, go over the bridge, and then just straight ahead. And if you feel lost, follow the butterflies. Do not ask anything, they will guide you. ",
            "speaker" : "npc",
            "neighbours" : [16]
        },
        {
            "id" : 16,
            "message" : "Alright, you are ready to explore now, traveller! And tell my wife I miss her!",
            "speaker" : "npc",
            "neighbours" : [17]
        },
        {
            "id" : 17,
            "message" : "I better be on my way now. Good luck on your patrol.",
            "speaker" : "player",
            "neighbours" : [18]
        },
        {
            "id" : 18,
            "message" : "See you later.",
            "speaker" : "npc",
            "neighbours" : []
        },
        {
            "id" : 19,
            "message" : "Ahh finally a human soul! I've been dying to talk to... oh, not having spare time are you eh? Okay then, back to patrol...",
            "speaker" : "npc",
            "neighbours" : [17]
        }
    ]
}
