{
    "nodes": [
        {
            "id": 0,
            "message": "Howdy! My name is Bill.",
            "speaker": "npc",
            "neighbours": [ 1 ]
        },
        {
            "id": 1,
            "message": "Uh... howdy?",
            "speaker": "player",
            "neighbours": [ 2 ]
        },
        {
            "id": 2,
            "message": "You survived the murlockalypse?",
            "speaker": "npc",
            "neighbours": [ 3 ]
        },
        {
            "id": 3,
            "message": "Yes, because I am a hero and not only an ordinary one.",
            "speaker": "player",
            "neighbours": [ 4 ]
        },
        {
            "id": 4,
            "message": "And what about Golems, Ogres?",
            "speaker": "npc",
            "neighbours": [ 5 ]
        },
        {
            "id": 5,
            "message": "If you want to go to the Wasteland, maybe, just maybe you should prepare yourself!",
            "speaker": "npc",
            "neighbours": [ 6 ]
        },
        {
            "id": 6,
            "message": "How?",
            "speaker": "player",
            "neighbours": [ 7 ]
        },
        {
            "id": 7,
            "message": "I have heard that my colleague on the north is looking for a help. Well and the city on the North is full of people who is eager to meet a great hero!",
            "speaker": "npc",
            "neighbours": [ 8 ]
        },
        {
            "id": 8,
            "message": "Thanks, so there is a city on the north?",
            "speaker": "player",
            "neighbours": [ 9 ]
        },
        {
            "id": 9,
            "message": "Yes, or you can go to Wasteland on the west if you want to be eaten by demons. Hehehe!",
            "speaker": "npc",
            "neighbours": []
        }
    ]
}