{
    "nodes" :
    [
        {
            "id" : 0,
            "message" : "There he is, our saviour. I hope the sword I gave you has fallen into the right hands.",
            "speaker" : "npc",
            "neighbours" : [1]
        },
        {
            "id" : 1,
            "message" : "The best hands. By the way you said that it was \"Geralts silver sword\" - who the hell is Geralt?",
            "speaker" : "player",
            "neighbours" : [2]
        },
        {
            "id" : 2,
            "message" : "Honestly? No idea...",
            "speaker" : "npc",
            "neighbours" : []
        }
    ]
}