%YAML 1.1
%TAG !u! tag:unity3d.com,2011:
--- !u!114 &11400000
MonoBehaviour:
  m_ObjectHideFlags: 0
  m_CorrespondingSourceObject: {fileID: 0}
  m_PrefabInstance: {fileID: 0}
  m_PrefabAsset: {fileID: 0}
  m_GameObject: {fileID: 0}
  m_Enabled: 1
  m_EditorHideFlags: 0
  m_Script: {fileID: 11500000, guid: 0afe003659c136c488f31bf5ddea8e95, type: 3}
  m_Name: manaPotion
  m_EditorClassIdentifier: 
  name: Mana potion
  icon: {fileID: 21300000, guid: 888374694292d4b4f9379f2a750b4f03, type: 3}
  drop_percentage: 100
  mana: 20
