{
    "nodes" :
    [
        {
            "id" : 0,
            "message" : "You did it! You fought them off.",
            "speaker" : "npc",
            "neighbours" : [1]
        },
        {
            "id" : 1,
            "message" : "Yes! I taught them a lesson. They should not be a problem anymore, the road is clear.",
            "speaker" : "player",
            "neighbours" : [2]
        },
        {
            "id" : 2,
            "message" : "We could not have done it without you. Here is your promised gold and guard's armour as a gift.",
            "speaker" : "npc",
            "neighbours" : []
        }
    ]
}