%YAML 1.1
%TAG !u! tag:unity3d.com,2011:
--- !u!1 &5095417850887009887
GameObject:
  m_ObjectHideFlags: 0
  m_CorrespondingSourceObject: {fileID: 0}
  m_PrefabInstance: {fileID: 0}
  m_PrefabAsset: {fileID: 0}
  serializedVersion: 6
  m_Component:
  - component: {fileID: 7277953358725529671}
  - component: {fileID: -9050136885443811448}
  m_Layer: 0
  m_Name: Iguana
  m_TagString: Untagged
  m_Icon: {fileID: 0}
  m_NavMeshLayer: 0
  m_StaticEditorFlags: 0
  m_IsActive: 1
--- !u!4 &7277953358725529671
Transform:
  m_ObjectHideFlags: 0
  m_CorrespondingSourceObject: {fileID: 0}
  m_PrefabInstance: {fileID: 0}
  m_PrefabAsset: {fileID: 0}
  m_GameObject: {fileID: 5095417850887009887}
  m_LocalRotation: {x: 0, y: 0, z: 0, w: 1}
  m_LocalPosition: {x: 0, y: 0, z: 0}
  m_LocalScale: {x: 1, y: 1, z: 1}
  m_Children: []
  m_Father: {fileID: 0}
  m_RootOrder: 0
  m_LocalEulerAnglesHint: {x: 0, y: 0, z: 0}
--- !u!114 &-9050136885443811448
MonoBehaviour:
  m_ObjectHideFlags: 0
  m_CorrespondingSourceObject: {fileID: 0}
  m_PrefabInstance: {fileID: 0}
  m_PrefabAsset: {fileID: 0}
  m_GameObject: {fileID: 5095417850887009887}
  m_Enabled: 1
  m_EditorHideFlags: 0
  m_Script: {fileID: 11500000, guid: 787b0d49aa1796744b92dc0de49ee5dc, type: 3}
  m_Name: 
  m_EditorClassIdentifier: 
  type: 9
  id: 0
  health: 250
  aggroRange: 3
  attackRange: 3
  attackDamage: 30
  attackDelay: 1.5
  movementSpeed: 3
  hostile: 0
  currentDestination: {x: 0, y: 0, z: 0}
  defaultPosition: {x: 0, y: 0, z: 0}
  wanderingRadius: 0
