{
    "nodes" :
    [
        {
            "id" : 0,
            "message" : "Hello there, are you new here?",
            "speaker" : "npc",
            "neighbours" : [1]
        },
        {
            "id" : 1,
            "message" : "I've just come to town. ",
            "speaker" : "player",
            "neighbours" : [2]
        },
        {
            "id" : 2,
            "message" : "Good to hear, hope you'll like it here though we've been having some problems recently....",
            "speaker" : "npc",
            "neighbours" : [3]
        },
        {
            "id" : 3,
            "message" : "What problems?",
            "speaker" : "player",
            "neighbours" : [4]
        },
        {
            "id" : 4,
            "message" : "Well you see, people are scared. Sometimes we get invaded by some uninvited guests.",
            "speaker" : "npc",
            "neighbours" : [5]
        },
        {
            "id" : 5,
            "message" : "I saw some goblins outside the town, very nearby. Is that what are you talking about?",
            "speaker" : "player",
            "neighbours" : [6]
        },
        {
            "id" : 6,
            "message" : "Oh not only that, actually...usually every day the tradesmen come to the city to provide us with food, weapons and more. But some of them stopped showing up!",
            "speaker" : "npc",
            "neighbours" : [7]
        },
        {
            "id" : 7,
            "message" : "Seems like something happened to them?",
            "speaker" : "player",
            "neighbours" : [8]
        },
        {
            "id" : 8,
            "message" : "We don't know, but we hope to find out. Some people are scared to travel to other villages, not only becauseo of these creatures out there but our people don't get along together. But you've just come here, are you a traveller?",
            "speaker" : "npc",
            "neighbours" : [9,10,11]
        },
        {
            "id" : 9,
            "message" : "Kind of.",
            "speaker" : "player",
            "neighbours" : [12]
        },
        {
            "id" : 10,
            "message" : "Not really..",
            "speaker" : "player",
            "neighbours" : [13]
        },
        {
            "id" : 11,
            "message" : "Gotta go",
            "speaker" : "player",
            "neighbours" : [16]
        },
        {
            "id" : 12,
            "message" : "Great! We could use your help. Go around town and get yourself some weapon, the blacksmith is just around the corner if you go up the town.",
            "speaker" : "npc",
            "neighbours" : [14]
        },
        {
            "id" : 13,
            "message" : "Oh what a shame...",
            "speaker" : "npc",
            "neighbours" : [15]
        },
        {
            "id" : 14,
            "message" : "I better be on my way then, hope to see you soon.",
            "speaker" : "player",
            "neighbours" : [17]
        },
        {
            "id" : 15,
            "message" : "I might be able to help though.",
            "speaker" : "player",
            "neighbours" : [12]
        },
        {
            "id" : 16,
            "message" : "Oh okay, hope to see you soon again!",
            "speaker" : "npc",
            "neighbours" : []
        },
        {
            "id" : 17,
            "message" : "I sure will!",
            "speaker" : "npc",
            "neighbours" : []
        }
    ]
}