%YAML 1.1
%TAG !u! tag:unity3d.com,2011:
--- !u!114 &11400000
MonoBehaviour:
  m_ObjectHideFlags: 0
  m_CorrespondingSourceObject: {fileID: 0}
  m_PrefabInstance: {fileID: 0}
  m_PrefabAsset: {fileID: 0}
  m_GameObject: {fileID: 0}
  m_Enabled: 1
  m_EditorHideFlags: 0
  m_Script: {fileID: 11500000, guid: f7322f4b8293a974d8ffe8eb1defd28e, type: 3}
  m_Name: chest
  m_EditorClassIdentifier: 
  name: Armor
  icon: {fileID: 21300000, guid: 292ee45f4814cdd4bb0a09eac7457ab3, type: 3}
  drop_percentage: 100
  armorModifier: 5
  damageModifier: 0
  equipSlot: 1
