%YAML 1.1
%TAG !u! tag:unity3d.com,2011:
--- !u!114 &11400000
MonoBehaviour:
  m_ObjectHideFlags: 0
  m_CorrespondingSourceObject: {fileID: 0}
  m_PrefabInstance: {fileID: 0}
  m_PrefabAsset: {fileID: 0}
  m_GameObject: {fileID: 0}
  m_Enabled: 1
  m_EditorHideFlags: 0
  m_Script: {fileID: 11500000, guid: 07a0f3b1ae0a391419828ba599fc9604, type: 3}
  m_Name: Questions_Interogation_End
  m_EditorClassIdentifier: 
  Text: Thank you
  RequiredSetFlags:
  - Beggar_Magic_Done
  - Beggar_Anyone_Done
  RequiredUnsetFlags: []
  NextDialogue: {fileID: 11400000, guid: 4842e936640ba8f4c89093d108e8cded, type: 2}
