%YAML 1.1
%TAG !u! tag:unity3d.com,2011:
--- !u!114 &11400000
MonoBehaviour:
  m_ObjectHideFlags: 0
  m_CorrespondingSourceObject: {fileID: 0}
  m_PrefabInstance: {fileID: 0}
  m_PrefabAsset: {fileID: 0}
  m_GameObject: {fileID: 0}
  m_Enabled: 1
  m_EditorHideFlags: 0
  m_Script: {fileID: 11500000, guid: f7b8991d272035d47a9834b692eae282, type: 3}
  m_Name: Questions_Necromancy_1_Scribe
  m_EditorClassIdentifier: 
  CharacterName: Scribe
  Choices: []
  NextDialogue: {fileID: 11400000, guid: 92a2f8c2b0e3a824d860b99c4bfad53e, type: 2}
  Lines:
  - Let me see...
  - This doesn't look good. It looks like it's one of the more dangerous types of
    dark magic and that is death magic, you probably know it as necromancy.
  - The art of comunicating with spirits and afterlife. Almost nothing that comes
    from it is good. You must make sure they don't succed.
  RequiredSetFlags: []
  RequiredUnsetFlags: []
  SetFlags:
  - Scribe_Necromancy_Done
  - Death_Magic
  UnsetFlags: []
