%YAML 1.1
%TAG !u! tag:unity3d.com,2011:
--- !u!114 &11400000
MonoBehaviour:
  m_ObjectHideFlags: 0
  m_CorrespondingSourceObject: {fileID: 0}
  m_PrefabInstance: {fileID: 0}
  m_PrefabAsset: {fileID: 0}
  m_GameObject: {fileID: 0}
  m_Enabled: 1
  m_EditorHideFlags: 0
  m_Script: {fileID: 11500000, guid: f7b8991d272035d47a9834b692eae282, type: 3}
  m_Name: Questions_Interogation_Anyone_Where_0_Hound
  m_EditorClassIdentifier: 
  CharacterName: The Hound
  Choices: []
  NextDialogue: {fileID: 11400000, guid: 17414f90454327442bf86221e52b3e72, type: 2}
  Lines:
  - Where did they go?
  RequiredSetFlags: []
  RequiredUnsetFlags: []
  SetFlags: []
  UnsetFlags: []
