%YAML 1.1
%TAG !u! tag:unity3d.com,2011:
--- !u!114 &11400000
MonoBehaviour:
  m_ObjectHideFlags: 0
  m_CorrespondingSourceObject: {fileID: 0}
  m_PrefabInstance: {fileID: 0}
  m_PrefabAsset: {fileID: 0}
  m_GameObject: {fileID: 0}
  m_Enabled: 1
  m_EditorHideFlags: 0
  m_Script: {fileID: 11500000, guid: f7b8991d272035d47a9834b692eae282, type: 3}
  m_Name: _0_Innkeeper
  m_EditorClassIdentifier: 
  CharacterName: Innkeeper
  Choices:
  - {fileID: 11400000, guid: 4bcbdbb5ce92eb2459fe633cf223b654, type: 2}
  - {fileID: 11400000, guid: 3c77bbfe3e3b6584d84e7027beb5db46, type: 2}
  NextDialogue: {fileID: 0}
  Lines:
  - Another round?
  RequiredSetFlags: []
  RequiredUnsetFlags: []
  SetFlags: []
  UnsetFlags: []
