%YAML 1.1
%TAG !u! tag:unity3d.com,2011:
--- !u!114 &11400000
MonoBehaviour:
  m_ObjectHideFlags: 0
  m_CorrespondingSourceObject: {fileID: 0}
  m_PrefabInstance: {fileID: 0}
  m_PrefabAsset: {fileID: 0}
  m_GameObject: {fileID: 0}
  m_Enabled: 1
  m_EditorHideFlags: 0
  m_Script: {fileID: 11500000, guid: f7b8991d272035d47a9834b692eae282, type: 3}
  m_Name: Confront_Pub_3_Priest
  m_EditorClassIdentifier: 
  CharacterName: Priest
  Choices: []
  NextDialogue: {fileID: 11400000, guid: 26d9f0208c4dbd54e88ba6c534f1e034, type: 2}
  Lines:
  - "Such establishment is no place for someone in my position. I have no idea what
    you speak of.\r"
  RequiredSetFlags: []
  RequiredUnsetFlags: []
  SetFlags: []
  UnsetFlags: []
