%YAML 1.1
%TAG !u! tag:unity3d.com,2011:
--- !u!114 &11400000
MonoBehaviour:
  m_ObjectHideFlags: 0
  m_CorrespondingSourceObject: {fileID: 0}
  m_PrefabInstance: {fileID: 0}
  m_PrefabAsset: {fileID: 0}
  m_GameObject: {fileID: 0}
  m_Enabled: 1
  m_EditorHideFlags: 0
  m_Script: {fileID: 11500000, guid: f7b8991d272035d47a9834b692eae282, type: 3}
  m_Name: Looking_1_Guard
  m_EditorClassIdentifier: 
  CharacterName: Guard
  Choices: []
  NextDialogue: {fileID: 11400000, guid: 53a6c4a978e6c2146ad4c67ea40edcaa, type: 2}
  Lines:
  - I'd suggest going to the town hall, they could know. There's a lot of people
    going through.
  RequiredSetFlags: []
  RequiredUnsetFlags: []
  SetFlags: []
  UnsetFlags: []
