%YAML 1.1
%TAG !u! tag:unity3d.com,2011:
--- !u!114 &11400000
MonoBehaviour:
  m_ObjectHideFlags: 0
  m_CorrespondingSourceObject: {fileID: 0}
  m_PrefabInstance: {fileID: 0}
  m_PrefabAsset: {fileID: 0}
  m_GameObject: {fileID: 0}
  m_Enabled: 1
  m_EditorHideFlags: 0
  m_Script: {fileID: 11500000, guid: f7b8991d272035d47a9834b692eae282, type: 3}
  m_Name: _1_Hound
  m_EditorClassIdentifier: 
  CharacterName: The Hound
  Choices:
  - {fileID: 11400000, guid: 2c8536deaab4ea94d8603d64aa0fd2c4, type: 2}
  - {fileID: 11400000, guid: b3449a122b42cc441ab8c89f13414b25, type: 2}
  - {fileID: 11400000, guid: 3854772e36b6fe2438c942891598ff22, type: 2}
  - {fileID: 11400000, guid: 8586df2c29f0f8a4a968f4fdf67f52e6, type: 2}
  NextDialogue: {fileID: 0}
  Lines:
  - Hmm...
  RequiredSetFlags: []
  RequiredUnsetFlags: []
  SetFlags: []
  UnsetFlags: []
