%YAML 1.1
%TAG !u! tag:unity3d.com,2011:
--- !u!114 &11400000
MonoBehaviour:
  m_ObjectHideFlags: 0
  m_CorrespondingSourceObject: {fileID: 0}
  m_PrefabInstance: {fileID: 0}
  m_PrefabAsset: {fileID: 0}
  m_GameObject: {fileID: 0}
  m_Enabled: 1
  m_EditorHideFlags: 0
  m_Script: {fileID: 11500000, guid: f7b8991d272035d47a9834b692eae282, type: 3}
  m_Name: General_Identity_0_Witch
  m_EditorClassIdentifier: 
  CharacterName: Apothecary
  Choices: []
  NextDialogue: {fileID: 11400000, guid: 556f8d39db7485e45bdb18649de646b6, type: 2}
  Lines:
  - Isn't it obvious? I thought the herbs, ointments and all that made it obvious.
    I'm an apothecary, what else would I be?
  RequiredSetFlags: []
  RequiredUnsetFlags: []
  SetFlags: []
  UnsetFlags: []
