%YAML 1.1
%TAG !u! tag:unity3d.com,2011:
--- !u!114 &11400000
MonoBehaviour:
  m_ObjectHideFlags: 0
  m_CorrespondingSourceObject: {fileID: 0}
  m_PrefabInstance: {fileID: 0}
  m_PrefabAsset: {fileID: 0}
  m_GameObject: {fileID: 0}
  m_Enabled: 1
  m_EditorHideFlags: 0
  m_Script: {fileID: 11500000, guid: 07a0f3b1ae0a391419828ba599fc9604, type: 3}
  m_Name: Questions_Ritual
  m_EditorClassIdentifier: 
  Text: Dead forest
  RequiredSetFlags:
  - Drain_Life
  - Scribe_Knows
  RequiredUnsetFlags:
  - Scribe_Ritual_Done
  - Dark_Magic
  NextDialogue: {fileID: 11400000, guid: 90a5f971935c25a4698be5500d2a8658, type: 2}
