%YAML 1.1
%TAG !u! tag:unity3d.com,2011:
--- !u!114 &11400000
MonoBehaviour:
  m_ObjectHideFlags: 0
  m_CorrespondingSourceObject: {fileID: 0}
  m_PrefabInstance: {fileID: 0}
  m_PrefabAsset: {fileID: 0}
  m_GameObject: {fileID: 0}
  m_Enabled: 1
  m_EditorHideFlags: 0
  m_Script: {fileID: 11500000, guid: f7b8991d272035d47a9834b692eae282, type: 3}
  m_Name: Looking_0_Hound
  m_EditorClassIdentifier: 
  CharacterName: The Hound
  Choices:
  - {fileID: 11400000, guid: 60b1f8812d6e60a4383e341e3454ae4b, type: 2}
  - {fileID: 11400000, guid: 04973993f1d31974bbefb1b0f391bc37, type: 2}
  - {fileID: 11400000, guid: 8b9357fc48bb6cc4395aa505a44a7f9c, type: 2}
  NextDialogue: {fileID: 0}
  Lines:
  - I'm looking for someone.
  RequiredSetFlags: []
  RequiredUnsetFlags: []
  SetFlags: []
  UnsetFlags: []
