%YAML 1.1
%TAG !u! tag:unity3d.com,2011:
--- !u!114 &11400000
MonoBehaviour:
  m_ObjectHideFlags: 0
  m_CorrespondingSourceObject: {fileID: 0}
  m_PrefabInstance: {fileID: 0}
  m_PrefabAsset: {fileID: 0}
  m_GameObject: {fileID: 0}
  m_Enabled: 1
  m_EditorHideFlags: 0
  m_Script: {fileID: 11500000, guid: f7b8991d272035d47a9834b692eae282, type: 3}
  m_Name: General_0_Hound
  m_EditorClassIdentifier: 
  CharacterName: The Hound
  Choices:
  - {fileID: 11400000, guid: db37034227cd32b4880c2b5225ed91b6, type: 2}
  - {fileID: 11400000, guid: c1f03ff91388f6e4ca9ec9b7c85d0cde, type: 2}
  - {fileID: 11400000, guid: 88b4448e6e0d7444f98d05981a96c382, type: 2}
  NextDialogue: {fileID: 0}
  Lines:
  - Let's talk about...
  RequiredSetFlags: []
  RequiredUnsetFlags: []
  SetFlags: []
  UnsetFlags: []
