%YAML 1.1
%TAG !u! tag:unity3d.com,2011:
--- !u!114 &11400000
MonoBehaviour:
  m_ObjectHideFlags: 0
  m_CorrespondingSourceObject: {fileID: 0}
  m_PrefabInstance: {fileID: 0}
  m_PrefabAsset: {fileID: 0}
  m_GameObject: {fileID: 0}
  m_Enabled: 1
  m_EditorHideFlags: 0
  m_Script: {fileID: 11500000, guid: f7b8991d272035d47a9834b692eae282, type: 3}
  m_Name: Questions_Sabotage_1_Witch
  m_EditorClassIdentifier: 
  CharacterName: Witch
  Choices: []
  NextDialogue: {fileID: 11400000, guid: f484a00dbe1a2244aad75424e3723765, type: 2}
  Lines:
  - "Sabotaged by destibilizing it, you say? Yes, it could probably be done. I never
    thought about it that way, but the necromancy is truly seen by practitioners
    as a tricky misstress. Just as it commands the death it can also cause yours.
    Give me a moment and I'll think of something.\r"
  RequiredSetFlags: []
  RequiredUnsetFlags: []
  SetFlags: []
  UnsetFlags: []
