%YAML 1.1
%TAG !u! tag:unity3d.com,2011:
--- !u!114 &11400000
MonoBehaviour:
  m_ObjectHideFlags: 0
  m_CorrespondingSourceObject: {fileID: 0}
  m_PrefabInstance: {fileID: 0}
  m_PrefabAsset: {fileID: 0}
  m_GameObject: {fileID: 0}
  m_Enabled: 1
  m_EditorHideFlags: 0
  m_Script: {fileID: 11500000, guid: f7b8991d272035d47a9834b692eae282, type: 3}
  m_Name: Confront_7_Priest
  m_EditorClassIdentifier: 
  CharacterName: Priest
  Choices: []
  NextDialogue: {fileID: 11400000, guid: e5f043e38af16b1438c8aec565ee3ad3, type: 2}
  Lines:
  - It is truly uncertain time, if dark magic is on the minds of the common folk.
    Having your mind clouded by such evil power is not the way, my child.
  RequiredSetFlags: []
  RequiredUnsetFlags: []
  SetFlags: []
  UnsetFlags: []
