%YAML 1.1
%TAG !u! tag:unity3d.com,2011:
--- !u!114 &11400000
MonoBehaviour:
  m_ObjectHideFlags: 0
  m_CorrespondingSourceObject: {fileID: 0}
  m_PrefabInstance: {fileID: 0}
  m_PrefabAsset: {fileID: 0}
  m_GameObject: {fileID: 0}
  m_Enabled: 1
  m_EditorHideFlags: 0
  m_Script: {fileID: 11500000, guid: f7b8991d272035d47a9834b692eae282, type: 3}
  m_Name: Ghost_0_Ghost
  m_EditorClassIdentifier: 
  CharacterName: Ghost
  Choices: []
  NextDialogue: {fileID: 11400000, guid: 7037da6b339f08341a2c28fc835102ac, type: 2}
  Lines:
  - Who is... there?
  - Can... you...
  - ...hear... me?
  RequiredSetFlags:
  - Ghost_Found
  RequiredUnsetFlags: []
  SetFlags: []
  UnsetFlags: []
