%YAML 1.1
%TAG !u! tag:unity3d.com,2011:
--- !u!114 &11400000
MonoBehaviour:
  m_ObjectHideFlags: 0
  m_CorrespondingSourceObject: {fileID: 0}
  m_PrefabInstance: {fileID: 0}
  m_PrefabAsset: {fileID: 0}
  m_GameObject: {fileID: 0}
  m_Enabled: 1
  m_EditorHideFlags: 0
  m_Script: {fileID: 11500000, guid: f7b8991d272035d47a9834b692eae282, type: 3}
  m_Name: General_Events_Witches_1_Captain
  m_EditorClassIdentifier: 
  CharacterName: Captain
  Choices:
  - {fileID: 11400000, guid: 74ec328c6ec259945aad728c184a92da, type: 2}
  NextDialogue: {fileID: 0}
  Lines:
  - It's just what some people believe. I don't have any opinion myself. My job is
    to keep people safe in the town, not out there.
  RequiredSetFlags: []
  RequiredUnsetFlags: []
  SetFlags: []
  UnsetFlags: []
