%YAML 1.1
%TAG !u! tag:unity3d.com,2011:
--- !u!114 &11400000
MonoBehaviour:
  m_ObjectHideFlags: 0
  m_CorrespondingSourceObject: {fileID: 0}
  m_PrefabInstance: {fileID: 0}
  m_PrefabAsset: {fileID: 0}
  m_GameObject: {fileID: 0}
  m_Enabled: 1
  m_EditorHideFlags: 0
  m_Script: {fileID: 11500000, guid: f7b8991d272035d47a9834b692eae282, type: 3}
  m_Name: Questions_Festival_2_Hound
  m_EditorClassIdentifier: 
  CharacterName: The Hound
  Choices: []
  NextDialogue: {fileID: 11400000, guid: 27f56530400c7de4c978f6f2eec08740, type: 2}
  Lines:
  - Oh. Was that what you ordered the special stuff for?
  RequiredSetFlags: []
  RequiredUnsetFlags: []
  SetFlags: []
  UnsetFlags: []
