%YAML 1.1
%TAG !u! tag:unity3d.com,2011:
--- !u!114 &11400000
MonoBehaviour:
  m_ObjectHideFlags: 0
  m_CorrespondingSourceObject: {fileID: 0}
  m_PrefabInstance: {fileID: 0}
  m_PrefabAsset: {fileID: 0}
  m_GameObject: {fileID: 0}
  m_Enabled: 1
  m_EditorHideFlags: 0
  m_Script: {fileID: 11500000, guid: 07a0f3b1ae0a391419828ba599fc9604, type: 3}
  m_Name: Confront_Spare
  m_EditorClassIdentifier: 
  Text: Spare
  RequiredSetFlags:
  - Can_Kill_Priest
  RequiredUnsetFlags: []
  NextDialogue: {fileID: 11400000, guid: fae1b4b2bda6a414a8704893c5860f27, type: 2}
