%YAML 1.1
%TAG !u! tag:unity3d.com,2011:
--- !u!114 &11400000
MonoBehaviour:
  m_ObjectHideFlags: 0
  m_CorrespondingSourceObject: {fileID: 0}
  m_PrefabInstance: {fileID: 0}
  m_PrefabAsset: {fileID: 0}
  m_GameObject: {fileID: 0}
  m_Enabled: 1
  m_EditorHideFlags: 0
  m_Script: {fileID: 11500000, guid: f7b8991d272035d47a9834b692eae282, type: 3}
  m_Name: General_EventsKnows_5_Scribe
  m_EditorClassIdentifier: 
  CharacterName: Scribe
  Choices: []
  NextDialogue: {fileID: 11400000, guid: f3b080f11805aa046aef0ad3a3241f12, type: 2}
  Lines:
  - That's the thing, as far as I know noone entered the town hall in the time that
    happened.
  - And I can't imagine mayor doing anything like stealing. Order and wellbeing of
    townspeople is important to him.
  - But if it's not him, then I have no clue as to who it realy was.
  RequiredSetFlags: []
  RequiredUnsetFlags: []
  SetFlags: []
  UnsetFlags: []
