%YAML 1.1
%TAG !u! tag:unity3d.com,2011:
--- !u!114 &11400000
MonoBehaviour:
  m_ObjectHideFlags: 0
  m_CorrespondingSourceObject: {fileID: 0}
  m_PrefabInstance: {fileID: 0}
  m_PrefabAsset: {fileID: 0}
  m_GameObject: {fileID: 0}
  m_Enabled: 1
  m_EditorHideFlags: 0
  m_Script: {fileID: 11500000, guid: f7b8991d272035d47a9834b692eae282, type: 3}
  m_Name: Questions_Interogation_Magic_3_Beggar
  m_EditorClassIdentifier: 
  CharacterName: Beggar
  Choices: []
  NextDialogue: {fileID: 11400000, guid: 0048b3ece0ecb8e498a2a11ed47f0c67, type: 2}
  Lines:
  - No, I crawled my way back to my camp, tried to heal my leg, thought maybe I just
    lost control of it. Thought I went mad, after what I saw.
  RequiredSetFlags: []
  RequiredUnsetFlags: []
  SetFlags:
  - Beggar_Magic_Done
  UnsetFlags: []
