%YAML 1.1
%TAG !u! tag:unity3d.com,2011:
--- !u!114 &11400000
MonoBehaviour:
  m_ObjectHideFlags: 0
  m_CorrespondingSourceObject: {fileID: 0}
  m_PrefabInstance: {fileID: 0}
  m_PrefabAsset: {fileID: 0}
  m_GameObject: {fileID: 0}
  m_Enabled: 1
  m_EditorHideFlags: 0
  m_Script: {fileID: 11500000, guid: f7b8991d272035d47a9834b692eae282, type: 3}
  m_Name: Altar_0_Hound
  m_EditorClassIdentifier: 
  CharacterName: The Hound
  Choices:
  - {fileID: 11400000, guid: 55a5ef78d00b2f24ca17da8c653e044a, type: 2}
  - {fileID: 11400000, guid: 008d9db6eee653c45be8b4a7602a2ea8, type: 2}
  NextDialogue: {fileID: 0}
  Lines:
  - This is the place where they're going to perform the ritual.
  - I could probably find someplace here to hide and wait for them to show up.
  RequiredSetFlags: []
  RequiredUnsetFlags:
  - Sabotage_Done
  SetFlags: []
  UnsetFlags: []
