%YAML 1.1
%TAG !u! tag:unity3d.com,2011:
--- !u!114 &11400000
MonoBehaviour:
  m_ObjectHideFlags: 0
  m_CorrespondingSourceObject: {fileID: 0}
  m_PrefabInstance: {fileID: 0}
  m_PrefabAsset: {fileID: 0}
  m_GameObject: {fileID: 0}
  m_Enabled: 1
  m_EditorHideFlags: 0
  m_Script: {fileID: 11500000, guid: f7b8991d272035d47a9834b692eae282, type: 3}
  m_Name: Questions_Sabotage_2_Narrator
  m_EditorClassIdentifier: 
  CharacterName: Narrator
  Choices: []
  NextDialogue: {fileID: 11400000, guid: 22a51f2de96968e40a2563aae006439d, type: 2}
  Lines:
  - "After moment of thinking she rummages thru her herbs and then gives you a handful
    of flower blossom similar to the ones you saw in the catacombs.\r"
  RequiredSetFlags: []
  RequiredUnsetFlags: []
  SetFlags: []
  UnsetFlags: []
