%YAML 1.1
%TAG !u! tag:unity3d.com,2011:
--- !u!114 &11400000
MonoBehaviour:
  m_ObjectHideFlags: 0
  m_CorrespondingSourceObject: {fileID: 0}
  m_PrefabInstance: {fileID: 0}
  m_PrefabAsset: {fileID: 0}
  m_GameObject: {fileID: 0}
  m_Enabled: 1
  m_EditorHideFlags: 0
  m_Script: {fileID: 11500000, guid: f7b8991d272035d47a9834b692eae282, type: 3}
  m_Name: _0_Apothecary
  m_EditorClassIdentifier: 
  CharacterName: Apothecary
  Choices: []
  NextDialogue: {fileID: 11400000, guid: 9b8b516bc097e374a90c46981ea9a004, type: 2}
  Lines:
  - "I\u2019ll put it upfront. No, I don\u2019t make potions. No, my ointments will
    not make your annoying neighbour\u2019s dog go away. And if you\u2019re here
    about that tincture last week, \u2026"
  RequiredSetFlags: []
  RequiredUnsetFlags:
  - MetWitch
  SetFlags:
  - MetWitch
  UnsetFlags: []
