%YAML 1.1
%TAG !u! tag:unity3d.com,2011:
--- !u!114 &11400000
MonoBehaviour:
  m_ObjectHideFlags: 0
  m_CorrespondingSourceObject: {fileID: 0}
  m_PrefabInstance: {fileID: 0}
  m_PrefabAsset: {fileID: 0}
  m_GameObject: {fileID: 0}
  m_Enabled: 1
  m_EditorHideFlags: 0
  m_Script: {fileID: 11500000, guid: f7b8991d272035d47a9834b692eae282, type: 3}
  m_Name: Questions_InPub_1_Priest
  m_EditorClassIdentifier: 
  CharacterName: Priest
  Choices: []
  NextDialogue: {fileID: 11400000, guid: 7c47c84130c1df048b4ee77d549de861, type: 2}
  Lines:
  - I heard the innkeeper is a good man, but that's about it. I do not venture into
    ... secular establishments.
  RequiredSetFlags:
  - Can_Conf_Priest
  - Priest_Pub_Conf
  RequiredUnsetFlags: []
  SetFlags: []
  UnsetFlags: []
