%YAML 1.1
%TAG !u! tag:unity3d.com,2011:
--- !u!114 &11400000
MonoBehaviour:
  m_ObjectHideFlags: 0
  m_CorrespondingSourceObject: {fileID: 0}
  m_PrefabInstance: {fileID: 0}
  m_PrefabAsset: {fileID: 0}
  m_GameObject: {fileID: 0}
  m_Enabled: 1
  m_EditorHideFlags: 0
  m_Script: {fileID: 11500000, guid: f7b8991d272035d47a9834b692eae282, type: 3}
  m_Name: Questions_0_Hound
  m_EditorClassIdentifier: 
  CharacterName: The Hound
  Choices:
  - {fileID: 11400000, guid: 04f62c54a3bda84479281dbfa04c8710, type: 2}
  - {fileID: 11400000, guid: eaca321f8db1e5043b14ca1dcd60de11, type: 2}
  - {fileID: 11400000, guid: 15566880cbb0a3f46b9db23ff5f3b521, type: 2}
  - {fileID: 11400000, guid: be75967b873dd60459becdee2e1b947a, type: 2}
  - {fileID: 11400000, guid: 505b03fc23bd29b4d93bea63cc05c494, type: 2}
  - {fileID: 11400000, guid: acb33987e25420d44920544cc9a9ecb8, type: 2}
  NextDialogue: {fileID: 0}
  Lines:
  - I'd like to ask something.
  RequiredSetFlags: []
  RequiredUnsetFlags: []
  SetFlags: []
  UnsetFlags: []
