%YAML 1.1
%TAG !u! tag:unity3d.com,2011:
--- !u!114 &11400000
MonoBehaviour:
  m_ObjectHideFlags: 0
  m_CorrespondingSourceObject: {fileID: 0}
  m_PrefabInstance: {fileID: 0}
  m_PrefabAsset: {fileID: 0}
  m_GameObject: {fileID: 0}
  m_Enabled: 1
  m_EditorHideFlags: 0
  m_Script: {fileID: 11500000, guid: f7b8991d272035d47a9834b692eae282, type: 3}
  m_Name: Confront_Ritual_3_Mayor
  m_EditorClassIdentifier: 
  CharacterName: Mayor
  Choices:
  - {fileID: 11400000, guid: b0d19756afa9ad04ba4e7493d01f3629, type: 2}
  - {fileID: 11400000, guid: c3414159133a58f4fb2afb0f442116b0, type: 2}
  NextDialogue: {fileID: 0}
  Lines:
  - We did what was right. Everyone else stood idly, we took action. And we have
    no reason to stop now.
  RequiredSetFlags: []
  RequiredUnsetFlags: []
  SetFlags: []
  UnsetFlags: []
