%YAML 1.1
%TAG !u! tag:unity3d.com,2011:
--- !u!114 &11400000
MonoBehaviour:
  m_ObjectHideFlags: 0
  m_CorrespondingSourceObject: {fileID: 0}
  m_PrefabInstance: {fileID: 0}
  m_PrefabAsset: {fileID: 0}
  m_GameObject: {fileID: 0}
  m_Enabled: 1
  m_EditorHideFlags: 0
  m_Script: {fileID: 11500000, guid: f7b8991d272035d47a9834b692eae282, type: 3}
  m_Name: ConfrontReveal_Looking_3_Scribe
  m_EditorClassIdentifier: 
  CharacterName: Scribe
  Choices: []
  NextDialogue: {fileID: 11400000, guid: 7580a2b85d1ec03438bc543a32f3dbff, type: 2}
  Lines:
  - Still doesn't mean I'm this councilman you speak of.
  RequiredSetFlags: []
  RequiredUnsetFlags: []
  SetFlags: []
  UnsetFlags: []
