%YAML 1.1
%TAG !u! tag:unity3d.com,2011:
--- !u!114 &11400000
MonoBehaviour:
  m_ObjectHideFlags: 0
  m_CorrespondingSourceObject: {fileID: 0}
  m_PrefabInstance: {fileID: 0}
  m_PrefabAsset: {fileID: 0}
  m_GameObject: {fileID: 0}
  m_Enabled: 1
  m_EditorHideFlags: 0
  m_Script: {fileID: 11500000, guid: f7b8991d272035d47a9834b692eae282, type: 3}
  m_Name: Questions_Interogation_Anyone_And_1_Beggar
  m_EditorClassIdentifier: 
  CharacterName: Beggar
  Choices: []
  NextDialogue: {fileID: 11400000, guid: c0931db9ee0a62d4b831b475c752ebab, type: 2}
  Lines:
  - I don't know, I didn't dare. And that saved my life.
  RequiredSetFlags: []
  RequiredUnsetFlags: []
  SetFlags: []
  UnsetFlags: []
