%YAML 1.1
%TAG !u! tag:unity3d.com,2011:
--- !u!114 &11400000
MonoBehaviour:
  m_ObjectHideFlags: 0
  m_CorrespondingSourceObject: {fileID: 0}
  m_PrefabInstance: {fileID: 0}
  m_PrefabAsset: {fileID: 0}
  m_GameObject: {fileID: 0}
  m_Enabled: 1
  m_EditorHideFlags: 0
  m_Script: {fileID: 11500000, guid: 07a0f3b1ae0a391419828ba599fc9604, type: 3}
  m_Name: Confront
  m_EditorClassIdentifier: 
  Text: Confront culprit
  RequiredSetFlags:
  - Can_Conf_Scribe
  RequiredUnsetFlags:
  - Pub_Closed
  - Scribe_Conf_Done2
  NextDialogue: {fileID: 11400000, guid: 06e772b833c2fd34d9b06a3f3558bbd9, type: 2}
