%YAML 1.1
%TAG !u! tag:unity3d.com,2011:
--- !u!114 &11400000
MonoBehaviour:
  m_ObjectHideFlags: 0
  m_CorrespondingSourceObject: {fileID: 0}
  m_PrefabInstance: {fileID: 0}
  m_PrefabAsset: {fileID: 0}
  m_GameObject: {fileID: 0}
  m_Enabled: 1
  m_EditorHideFlags: 0
  m_Script: {fileID: 11500000, guid: 07a0f3b1ae0a391419828ba599fc9604, type: 3}
  m_Name: Questions_Interogation
  m_EditorClassIdentifier: 
  Text: Camp in the forest
  RequiredSetFlags:
  - Camp_Found
  RequiredUnsetFlags:
  - Beggar_Interogated
  NextDialogue: {fileID: 11400000, guid: 9a122dbee72543d4c8855dd5eb73c25e, type: 2}
