%YAML 1.1
%TAG !u! tag:unity3d.com,2011:
--- !u!114 &11400000
MonoBehaviour:
  m_ObjectHideFlags: 0
  m_CorrespondingSourceObject: {fileID: 0}
  m_PrefabInstance: {fileID: 0}
  m_PrefabAsset: {fileID: 0}
  m_GameObject: {fileID: 0}
  m_Enabled: 1
  m_EditorHideFlags: 0
  m_Script: {fileID: 11500000, guid: f7b8991d272035d47a9834b692eae282, type: 3}
  m_Name: Looking_0_Hound
  m_EditorClassIdentifier: 
  CharacterName: The Hound
  Choices:
  - {fileID: 11400000, guid: 23e5dd751d0f0f9479e0588638bab0d2, type: 2}
  - {fileID: 11400000, guid: 6bb5ec37004da7d47abf12b55e506395, type: 2}
  - {fileID: 11400000, guid: f7774000d1f3eec4aaaf851751626934, type: 2}
  - {fileID: 11400000, guid: e2be89b88eccd1e4ea2ae874abefb7d1, type: 2}
  - {fileID: 11400000, guid: 639ba408820c42f45a6e4a3930853bb7, type: 2}
  NextDialogue: {fileID: 0}
  Lines:
  - I'm looking for someone.
  RequiredSetFlags: []
  RequiredUnsetFlags: []
  SetFlags: []
  UnsetFlags: []
