%YAML 1.1
%TAG !u! tag:unity3d.com,2011:
--- !u!114 &11400000
MonoBehaviour:
  m_ObjectHideFlags: 0
  m_CorrespondingSourceObject: {fileID: 0}
  m_PrefabInstance: {fileID: 0}
  m_PrefabAsset: {fileID: 0}
  m_GameObject: {fileID: 0}
  m_Enabled: 1
  m_EditorHideFlags: 0
  m_Script: {fileID: 11500000, guid: f7b8991d272035d47a9834b692eae282, type: 3}
  m_Name: Questions_Sabotage_1_Scribe
  m_EditorClassIdentifier: 
  CharacterName: Scribe
  Choices: []
  NextDialogue: {fileID: 11400000, guid: 92a2f8c2b0e3a824d860b99c4bfad53e, type: 2}
  Lines:
  - There might be a way. Since raising dead is high level of magic it's not an easy
    task. And from the looks of it, they seem like they are still amateurs.
  - 'If you could find a way to disrupt their preparations without them knowing then
    you could stop them from performing it.

'
  - But be careful, if you don't know what you're doing then it could have catastrofic
    repercussions. It would be best if you consulted it with actual practitioner
    instead of just me, but this is all I can do right now.
  RequiredSetFlags: []
  RequiredUnsetFlags: []
  SetFlags:
  - Scribe_Sabotage_Done
  - Sabotage_Hint
  UnsetFlags: []
