%YAML 1.1
%TAG !u! tag:unity3d.com,2011:
--- !u!114 &11400000
MonoBehaviour:
  m_ObjectHideFlags: 0
  m_CorrespondingSourceObject: {fileID: 0}
  m_PrefabInstance: {fileID: 0}
  m_PrefabAsset: {fileID: 0}
  m_GameObject: {fileID: 0}
  m_Enabled: 1
  m_EditorHideFlags: 0
  m_Script: {fileID: 11500000, guid: f7b8991d272035d47a9834b692eae282, type: 3}
  m_Name: General_Odd2_0_Hound
  m_EditorClassIdentifier: 
  CharacterName: The Hound
  Choices: []
  NextDialogue: {fileID: 11400000, guid: cc9c68d62f1e42e4387393aa68a3d6ee, type: 2}
  Lines:
  - Has anything odd happened recently?
  RequiredSetFlags: []
  RequiredUnsetFlags: []
  SetFlags: []
  UnsetFlags: []
