[gd_scene load_steps=10 format=2]

[ext_resource path="res://src/Map/Map.gd" type="Script" id=1]
[ext_resource path="res://assets/vertical_8.tres" type="TileSet" id=2]
[ext_resource path="res://assets/Styles/BoxTheme.tres" type="Theme" id=3]
[ext_resource path="res://src/Enemy/_Old/Sniper/Sniper.tscn" type="PackedScene" id=4]
[ext_resource path="res://src/Player/Player.tscn" type="PackedScene" id=5]
[ext_resource path="res://src/Item/Consumable/DefensePotion.tscn" type="PackedScene" id=6]
[ext_resource path="res://src/Item/Consumable/Ciggy/Ciggy.tscn" type="PackedScene" id=7]
[ext_resource path="res://src/Item/Consumable/Beer.tscn" type="PackedScene" id=8]
[ext_resource path="res://src/Item/Consumable/AgilityPotion.tscn" type="PackedScene" id=9]

[node name="Map" type="Node2D"]
script = ExtResource( 1 )

[node name="Nav" type="Navigation2D" parent="."]
cell_size = 16.0

[node name="Walls" type="TileMap" parent="Nav"]
mode = 2
tile_set = ExtResource( 2 )
cell_size = Vector2( 16, 16 )
cell_custom_transform = Transform2D( 16, 0, 0, 16, 0, 0 )
cell_tile_origin = 2
cell_y_sort = true
bake_navigation = true
format = 1
tile_data = PoolIntArray( -1572907, 80, 0, -1572906, 80, 0, -1572905, 80, 0, -1572904, 80, 0, -1572903, 80, 0, -1572902, 80, 0, -1572901, 80, 0, -1572900, 80, 0, -1572899, 80, 0, -1572898, 80, 0, -1572897, 80, 0, -1572896, 80, 0, -1572895, 80, 0, -1572894, 80, 0, -1572893, 80, 0, -1572892, 80, 0, -1572891, 80, 0, -1572890, 80, 0, -1572889, 80, 0, -1572888, 80, 0, -1572887, 80, 0, -1572886, 80, 0, -1572885, 80, 0, -1572884, 80, 0, -1572883, 80, 0, -1572882, 80, 0, -1572881, 80, 0, -1572880, 80, 0, -1572879, 80, 0, -1572878, 80, 0, -1572877, 80, 0, -1572876, 80, 0, -1572875, 80, 0, -1572874, 80, 0, -1572873, 80, 0, -1572872, 80, 0, -1572871, 80, 0, -1507371, 80, 0, -1507370, 81, 0, -1507369, 81, 0, -1507368, 81, 0, -1507367, 81, 0, -1507366, 81, 0, -1507365, 81, 0, -1507364, 81, 0, -1507363, 81, 0, -1507362, 81, 0, -1507361, 81, 0, -1507360, 81, 0, -1507359, 81, 0, -1507358, 81, 0, -1507357, 81, 0, -1507356, 81, 0, -1507355, 81, 0, -1507354, 80, 0, -1507353, 81, 0, -1507352, 81, 0, -1507351, 81, 0, -1507350, 81, 0, -1507349, 81, 0, -1507348, 81, 0, -1507347, 81, 0, -1507346, 81, 0, -1507345, 81, 0, -1507344, 81, 0, -1507343, 81, 0, -1507342, 81, 0, -1507341, 81, 0, -1507340, 81, 0, -1507339, 81, 0, -1507338, 81, 0, -1507337, 81, 0, -1507336, 81, 0, -1507335, 80, 0, -1441835, 80, 0, -1441834, 81, 0, -1441833, 81, 0, -1441832, 81, 0, -1441831, 81, 0, -1441830, 81, 0, -1441829, 81, 0, -1441828, 81, 0, -1441827, 81, 0, -1441826, 81, 0, -1441825, 81, 0, -1441824, 81, 0, -1441823, 81, 0, -1441822, 81, 0, -1441821, 81, 0, -1441820, 81, 0, -1441819, 81, 0, -1441818, 80, 0, -1441817, 81, 0, -1441816, 81, 0, -1441815, 81, 0, -1441814, 81, 0, -1441813, 81, 0, -1441812, 81, 0, -1441811, 81, 0, -1441810, 81, 0, -1441809, 81, 0, -1441808, 81, 0, -1441807, 81, 0, -1441806, 81, 0, -1441805, 81, 0, -1441804, 81, 0, -1441803, 81, 0, -1441802, 81, 0, -1441801, 81, 0, -1441800, 81, 0, -1441799, 80, 0, -1376299, 80, 0, -1376298, 81, 0, -1376297, 81, 0, -1376296, 81, 0, -1376295, 81, 0, -1376294, 81, 0, -1376293, 81, 0, -1376292, 81, 0, -1376291, 81, 0, -1376290, 81, 0, -1376289, 81, 0, -1376288, 81, 0, -1376287, 81, 0, -1376286, 81, 0, -1376285, 81, 0, -1376284, 81, 0, -1376283, 81, 0, -1376282, 80, 0, -1376281, 81, 0, -1376280, 81, 0, -1376279, 81, 0, -1376278, 81, 0, -1376277, 81, 0, -1376276, 81, 0, -1376275, 81, 0, -1376274, 81, 0, -1376273, 81, 0, -1376272, 81, 0, -1376271, 81, 0, -1376270, 81, 0, -1376269, 81, 0, -1376268, 81, 0, -1376267, 81, 0, -1376266, 81, 0, -1376265, 81, 0, -1376264, 81, 0, -1376263, 80, 0, -1310763, 80, 0, -1310762, 81, 0, -1310761, 81, 0, -1310760, 81, 0, -1310759, 81, 0, -1310758, 81, 0, -1310757, 81, 0, -1310756, 81, 0, -1310755, 81, 0, -1310754, 81, 0, -1310753, 81, 0, -1310752, 81, 0, -1310751, 81, 0, -1310750, 81, 0, -1310749, 81, 0, -1310748, 81, 0, -1310747, 81, 0, -1310746, 80, 0, -1310745, 81, 0, -1310744, 81, 0, -1310743, 81, 0, -1310742, 81, 0, -1310741, 81, 0, -1310740, 81, 0, -1310739, 81, 0, -1310738, 81, 0, -1310737, 81, 0, -1310736, 81, 0, -1310735, 81, 0, -1310734, 81, 0, -1310733, 81, 0, -1310732, 81, 0, -1310731, 81, 0, -1310730, 81, 0, -1310729, 81, 0, -1310728, 81, 0, -1310727, 80, 0, -1245227, 80, 0, -1245226, 81, 0, -1245225, 81, 0, -1245224, 81, 0, -1245223, 81, 0, -1245222, 81, 0, -1245221, 81, 0, -1245220, 81, 0, -1245219, 81, 0, -1245218, 81, 0, -1245217, 81, 0, -1245216, 81, 0, -1245215, 81, 0, -1245214, 81, 0, -1245213, 81, 0, -1245212, 81, 0, -1245211, 81, 0, -1245210, 80, 0, -1245209, 81, 0, -1245208, 81, 0, -1245207, 81, 0, -1245206, 81, 0, -1245205, 81, 0, -1245204, 81, 0, -1245203, 81, 0, -1245202, 81, 0, -1245201, 81, 0, -1245200, 81, 0, -1245199, 81, 0, -1245198, 81, 0, -1245197, 81, 0, -1245196, 81, 0, -1245195, 81, 0, -1245194, 81, 0, -1245193, 81, 0, -1245192, 81, 0, -1245191, 80, 0, -1179691, 80, 0, -1179690, 81, 0, -1179689, 81, 0, -1179688, 81, 0, -1179687, 81, 0, -1179686, 81, 0, -1179685, 81, 0, -1179684, 81, 0, -1179683, 81, 0, -1179682, 81, 0, -1179681, 81, 0, -1179680, 81, 0, -1179679, 81, 0, -1179678, 81, 0, -1179677, 81, 0, -1179676, 81, 0, -1179675, 81, 0, -1179674, 80, 0, -1179673, 81, 0, -1179672, 81, 0, -1179671, 81, 0, -1179670, 81, 0, -1179669, 81, 0, -1179668, 81, 0, -1179667, 81, 0, -1179666, 81, 0, -1179665, 81, 0, -1179664, 81, 0, -1179663, 81, 0, -1179662, 81, 0, -1179661, 81, 0, -1179660, 81, 0, -1179659, 81, 0, -1179658, 81, 0, -1179657, 81, 0, -1179656, 81, 0, -1179655, 80, 0, -1114155, 80, 0, -1114154, 81, 0, -1114153, 81, 0, -1114152, 81, 0, -1114151, 81, 0, -1114150, 81, 0, -1114149, 81, 0, -1114148, 81, 0, -1114147, 81, 0, -1114146, 81, 0, -1114145, 81, 0, -1114144, 81, 0, -1114143, 81, 0, -1114142, 81, 0, -1114141, 81, 0, -1114140, 81, 0, -1114139, 81, 0, -1114138, 80, 0, -1114137, 81, 0, -1114136, 81, 0, -1114135, 81, 0, -1114134, 81, 0, -1114133, 81, 0, -1114132, 81, 0, -1114131, 81, 0, -1114130, 81, 0, -1114129, 81, 0, -1114128, 81, 0, -1114127, 81, 0, -1114126, 81, 0, -1114125, 81, 0, -1114124, 81, 0, -1114123, 81, 0, -1114122, 81, 0, -1114121, 81, 0, -1114120, 81, 0, -1114119, 80, 0, -1048619, 80, 0, -1048618, 81, 0, -1048617, 81, 0, -1048616, 81, 0, -1048615, 81, 0, -1048614, 81, 0, -1048613, 81, 0, -1048612, 81, 0, -1048611, 81, 0, -1048610, 81, 0, -1048609, 81, 0, -1048608, 81, 0, -1048607, 81, 0, -1048606, 81, 0, -1048605, 81, 0, -1048604, 81, 0, -1048603, 81, 0, -1048602, 80, 0, -1048601, 81, 0, -1048600, 81, 0, -1048599, 81, 0, -1048598, 81, 0, -1048597, 81, 0, -1048596, 81, 0, -1048595, 81, 0, -1048594, 81, 0, -1048593, 81, 0, -1048592, 81, 0, -1048591, 81, 0, -1048590, 81, 0, -1048589, 81, 0, -1048588, 81, 0, -1048587, 81, 0, -1048586, 81, 0, -1048585, 81, 0, -1048584, 81, 0, -1048583, 80, 0, -983083, 80, 0, -983082, 80, 0, -983081, 80, 0, -983080, 80, 0, -983079, 80, 0, -983078, 80, 0, -983077, 80, 0, -983076, 80, 0, -983075, 80, 0, -983074, 80, 0, -983073, 82, 0, -983072, 82, 0, -983071, 80, 0, -983070, 80, 0, -983069, 80, 0, -983068, 80, 0, -983067, 80, 0, -983066, 80, 0, -983065, 80, 0, -983064, 80, 0, -983063, 80, 0, -983062, 82, 0, -983061, 82, 0, -983060, 80, 0, -983059, 80, 0, -983058, 80, 0, -983057, 80, 0, -983056, 80, 0, -983055, 80, 0, -983054, 80, 0, -983053, 80, 0, -983052, 80, 0, -983051, 80, 0, -983050, 80, 0, -983049, 80, 0, -983048, 80, 0, -983047, 80, 0, -917538, 80, 0, -917537, 81, 0, -917536, 81, 0, -917535, 81, 0, -917534, 81, 0, -917533, 80, 0, -917527, 80, 0, -917526, 81, 0, -917525, 81, 0, -917524, 81, 0, -917523, 81, 0, -917522, 80, 0, -852002, 80, 0, -852001, 81, 0, -852000, 81, 0, -851999, 81, 0, -851998, 81, 0, -851997, 80, 0, -851991, 80, 0, -851990, 81, 0, -851989, 81, 0, -851988, 81, 0, -851987, 81, 0, -851986, 80, 0, -786466, 80, 0, -786465, 81, 0, -786464, 81, 0, -786463, 81, 0, -786462, 81, 0, -786461, 80, 0, -786455, 80, 0, -786454, 81, 0, -786453, 81, 0, -786452, 81, 0, -786451, 81, 0, -786450, 80, 0, -720930, 80, 0, -720929, 80, 0, -720928, 80, 0, -720927, 81, 0, -720926, 81, 0, -720925, 80, 0, -720919, 80, 0, -720918, 80, 0, -720917, 80, 0, -720916, 81, 0, -720915, 81, 0, -720914, 80, 0, -655394, 80, 0, -655393, 81, 0, -655392, 81, 0, -655391, 81, 0, -655390, 81, 0, -655389, 80, 0, -655383, 80, 0, -655382, 81, 0, -655381, 81, 0, -655380, 81, 0, -655379, 81, 0, -655378, 80, 0, -589858, 80, 0, -589857, 81, 0, -589856, 81, 0, -589855, 81, 0, -589854, 81, 0, -589853, 80, 0, -589847, 80, 0, -589846, 81, 0, -589845, 81, 0, -589844, 81, 0, -589843, 81, 0, -589842, 80, 0, -524322, 80, 0, -524321, 81, 0, -524320, 81, 0, -524319, 81, 0, -524318, 81, 0, -524317, 80, 0, -524311, 80, 0, -524310, 81, 0, -524309, 81, 0, -524308, 81, 0, -524307, 81, 0, -524306, 80, 0, -458789, 80, 0, -458788, 80, 0, -458787, 80, 0, -458786, 80, 0, -458785, 81, 0, -458784, 81, 0, -458783, 80, 0, -458782, 80, 0, -458781, 80, 0, -458780, 80, 0, -458779, 80, 0, -458778, 80, 0, -458777, 80, 0, -458776, 80, 0, -458775, 80, 0, -458774, 81, 0, -458773, 81, 0, -458772, 80, 0, -458771, 80, 0, -458770, 80, 0, -458769, 80, 0, -458768, 80, 0, -393253, 80, 0, -393252, 81, 0, -393251, 81, 0, -393250, 81, 0, -393249, 81, 0, -393248, 81, 0, -393247, 81, 0, -393246, 81, 0, -393245, 81, 0, -393244, 81, 0, -393243, 81, 0, -393242, 81, 0, -393241, 81, 0, -393240, 81, 0, -393239, 81, 0, -393238, 81, 0, -393237, 81, 0, -393236, 81, 0, -393235, 81, 0, -393234, 81, 0, -393233, 81, 0, -393232, 80, 0, -327717, 80, 0, -327716, 81, 0, -327715, 81, 0, -327714, 81, 0, -327713, 81, 0, -327712, 81, 0, -327711, 81, 0, -327710, 81, 0, -327709, 81, 0, -327708, 81, 0, -327707, 81, 0, -327706, 81, 0, -327705, 81, 0, -327704, 81, 0, -327703, 81, 0, -327702, 81, 0, -327701, 81, 0, -327700, 81, 0, -327699, 81, 0, -327698, 81, 0, -327697, 81, 0, -327696, 80, 0, -262181, 81, 0, -262180, 81, 0, -262179, 81, 0, -262178, 81, 0, -262177, 81, 0, -262175, 81, 0, -262174, 81, 0, -262173, 81, 0, -262172, 81, 0, -262171, 81, 0, -262170, 81, 0, -262169, 81, 0, -262168, 81, 0, -262167, 81, 0, -262166, 81, 0, -262165, 81, 0, -262164, 81, 0, -262163, 81, 0, -262162, 81, 0, -262161, 81, 0, -262160, 81, 0, -196645, 81, 0, -196644, 81, 0, -196643, 81, 0, -196642, 81, 0, -196641, 81, 0, -196640, 80, 0, -196639, 80, 0, -196638, 80, 0, -196637, 81, 0, -196636, 81, 0, -196635, 81, 0, -196634, 81, 0, -196633, 81, 0, -196632, 81, 0, -196631, 81, 0, -196630, 81, 0, -196629, 81, 0, -196628, 81, 0, -196627, 81, 0, -196626, 81, 0, -196625, 81, 0, -196624, 81, 0, -131109, 81, 0, -131108, 81, 0, -131107, 81, 0, -131106, 81, 0, -131105, 81, 0, -131104, 81, 0, -131103, 81, 0, -131102, 81, 0, -131101, 81, 0, -131100, 81, 0, -131099, 81, 0, -131098, 81, 0, -131097, 81, 0, -131096, 81, 0, -131095, 81, 0, -131094, 81, 0, -131093, 81, 0, -131092, 81, 0, -131091, 81, 0, -131090, 81, 0, -131089, 81, 0, -131088, 81, 0, -65573, 81, 0, -65572, 81, 0, -65571, 81, 0, -65570, 81, 0, -65569, 81, 0, -65568, 81, 0, -65567, 81, 0, -65566, 81, 0, -65565, 81, 0, -65564, 81, 0, -65563, 81, 0, -65562, 81, 0, -65561, 81, 0, -65560, 81, 0, -65559, 81, 0, -65558, 81, 0, -65557, 81, 0, -65556, 81, 0, -65555, 81, 0, -65554, 81, 0, -65553, 81, 0, -65552, 81, 0, -37, 80, 0, -36, 81, 0, -35, 81, 0, -34, 81, 0, -33, 81, 0, -32, 81, 0, -31, 81, 0, -30, 81, 0, -29, 81, 0, -28, 81, 0, -27, 81, 0, -26, 81, 0, -25, 81, 0, -24, 81, 0, -23, 81, 0, -22, 81, 0, -21, 81, 0, -20, 81, 0, -19, 81, 0, -18, 81, 0, -17, 81, 0, -16, 80, 0, -3, 80, 0, 65499, 80, 0, 65500, 81, 0, 65501, 81, 0, 65502, 81, 0, 65503, 81, 0, 65504, 81, 0, 65505, 81, 0, 65506, 81, 0, 65507, 81, 0, 65508, 81, 0, 65509, 81, 0, 65510, 81, 0, 65511, 81, 0, 65512, 81, 0, 65513, 81, 0, 65514, 81, 0, 65515, 81, 0, 65516, 81, 0, 65517, 81, 0, 65518, 81, 0, 65519, 81, 0, 65520, 80, 0, 131035, 80, 0, 131036, 81, 0, 131037, 81, 0, 131038, 81, 0, 131039, 81, 0, 131040, 81, 0, 131041, 81, 0, 131042, 81, 0, 131043, 81, 0, 131044, 81, 0, 131045, 81, 0, 131046, 81, 0, 131047, 81, 0, 131048, 81, 0, 131049, 81, 0, 131050, 81, 0, 131051, 81, 0, 131052, 81, 0, 131053, 81, 0, 131054, 81, 0, 131055, 81, 0, 131056, 80, 0, 196571, 80, 0, 196572, 81, 0, 196573, 81, 0, 196574, 81, 0, 196575, 81, 0, 196576, 81, 0, 196577, 81, 0, 196578, 81, 0, 196579, 81, 0, 196580, 81, 0, 196581, 81, 0, 196582, 81, 0, 196583, 81, 0, 196584, 81, 0, 196585, 81, 0, 196586, 81, 0, 196587, 81, 0, 196588, 81, 0, 196589, 81, 0, 196590, 81, 0, 196591, 81, 0, 196592, 80, 0, 262107, 80, 0, 262108, 81, 0, 262109, 81, 0, 262110, 81, 0, 262111, 81, 0, 262112, 81, 0, 262113, 81, 0, 262114, 81, 0, 262115, 81, 0, 262116, 81, 0, 262117, 81, 0, 262118, 81, 0, 262119, 81, 0, 262120, 81, 0, 262121, 81, 0, 262122, 81, 0, 262123, 81, 0, 262124, 81, 0, 262125, 81, 0, 262126, 81, 0, 262127, 81, 0, 262128, 80, 0, 327643, 80, 0, 327644, 81, 0, 327645, 81, 0, 327646, 81, 0, 327647, 81, 0, 327648, 81, 0, 327649, 81, 0, 327650, 81, 0, 327651, 81, 0, 327652, 81, 0, 327653, 81, 0, 327654, 81, 0, 327655, 81, 0, 327656, 81, 0, 327657, 81, 0, 327658, 81, 0, 327659, 81, 0, 327660, 81, 0, 327661, 81, 0, 327662, 81, 0, 327663, 81, 0, 327664, 80, 0, 393179, 80, 0, 393180, 81, 0, 393181, 81, 0, 393182, 81, 0, 393183, 81, 0, 393184, 81, 0, 393185, 81, 0, 393186, 81, 0, 393187, 81, 0, 393188, 81, 0, 393189, 81, 0, 393190, 81, 0, 393191, 81, 0, 393192, 81, 0, 393193, 81, 0, 393194, 81, 0, 393195, 81, 0, 393196, 81, 0, 393197, 81, 0, 393198, 81, 0, 393199, 81, 0, 393200, 80, 0, 458715, 80, 0, 458716, 81, 0, 458717, 81, 0, 458718, 81, 0, 458719, 81, 0, 458720, 81, 0, 458721, 81, 0, 458722, 81, 0, 458723, 81, 0, 458724, 81, 0, 458725, 81, 0, 458726, 81, 0, 458727, 81, 0, 458728, 81, 0, 458729, 81, 0, 458730, 81, 0, 458731, 81, 0, 458732, 81, 0, 458733, 81, 0, 458734, 81, 0, 458735, 81, 0, 458736, 80, 0, 524251, 80, 0, 524252, 81, 0, 524253, 81, 0, 524254, 81, 0, 524255, 81, 0, 524256, 81, 0, 524257, 81, 0, 524258, 81, 0, 524259, 81, 0, 524260, 81, 0, 524261, 81, 0, 524262, 81, 0, 524263, 81, 0, 524264, 81, 0, 524265, 81, 0, 524266, 81, 0, 524267, 81, 0, 524268, 81, 0, 524269, 81, 0, 524270, 81, 0, 524271, 81, 0, 524272, 80, 0, 589787, 80, 0, 589788, 80, 0, 589789, 80, 0, 589790, 80, 0, 589791, 80, 0, 589792, 80, 0, 589793, 80, 0, 589794, 80, 0, 589795, 80, 0, 589796, 80, 0, 589797, 80, 0, 589798, 80, 0, 589799, 80, 0, 589800, 80, 0, 589801, 80, 0, 589802, 80, 0, 589803, 80, 0, 589804, 80, 0, 589805, 80, 0, 589806, 80, 0, 589807, 80, 0, 589808, 80, 0 )

[node name="Player" parent="Nav/Walls" instance=ExtResource( 5 )]
position = Vector2( -406, -27 )
hp_regen = 1

[node name="Enemy" parent="Nav/Walls" instance=ExtResource( 4 )]
position = Vector2( -518, -302 )

[node name="Beer" parent="Nav/Walls" instance=ExtResource( 8 )]
position = Vector2( -522, 15 )

[node name="Ciggy" parent="Nav/Walls" instance=ExtResource( 7 )]
position = Vector2( -437, 35 )

[node name="AgilityPotion" parent="Nav/Walls" instance=ExtResource( 9 )]
position = Vector2( -506, 69 )

[node name="DefensePotion" parent="Nav/Walls" instance=ExtResource( 6 )]
position = Vector2( -355, 72 )

[node name="Beer2" parent="Nav/Walls" instance=ExtResource( 8 )]
position = Vector2( -337, 11 )

[node name="Beer3" parent="Nav/Walls" instance=ExtResource( 8 )]
position = Vector2( -423, 75 )

[node name="Areas" type="Node2D" parent="Nav/Walls"]

[node name="Labels" type="Node2D" parent="Nav/Walls"]
position = Vector2( -495, -145 )
scale = Vector2( 0.5, 0.5 )
z_index = 999

[node name="Label" type="Label" parent="Nav/Walls/Labels"]
margin_right = 74.0
margin_bottom = 30.0
theme = ExtResource( 3 )
text = "Lalalala"

[node name="Objects" type="TileMap" parent="Nav/Walls"]
mode = 2
tile_set = ExtResource( 2 )
cell_size = Vector2( 8, 8 )
cell_custom_transform = Transform2D( 8, 0, 0, 8, 0, 0 )
cell_tile_origin = 2
cell_y_sort = true
show_collision = true
bake_navigation = true
format = 1
tile_data = PoolIntArray( -917548, 83, 0, -917546, 83, 0, -655413, 19, 0, -589874, 19, 0 )
