[gd_resource type="SpriteFrames" load_steps=27 format=2]

[ext_resource path="res://src/Npc/Serf/serf_idle.png" type="Texture" id=1]
[ext_resource path="res://src/Npc/Serf/village_serf_walking_down.png" type="Texture" id=2]
[ext_resource path="res://src/Npc/Serf/village_serf_walking_up.png" type="Texture" id=3]
[ext_resource path="res://src/Npc/Serf/serf_idle_up.png" type="Texture" id=4]

[sub_resource type="AtlasTexture" id=1]
atlas = ExtResource( 1 )
region = Rect2( 0, 0, 16, 32 )

[sub_resource type="AtlasTexture" id=2]
atlas = ExtResource( 1 )
region = Rect2( 16, 0, 16, 32 )

[sub_resource type="AtlasTexture" id=3]
atlas = ExtResource( 1 )
region = Rect2( 0, 0, 16, 32 )

[sub_resource type="AtlasTexture" id=4]
atlas = ExtResource( 1 )
region = Rect2( 16, 0, 16, 32 )

[sub_resource type="AtlasTexture" id=5]
atlas = ExtResource( 1 )
region = Rect2( 32, 0, 16, 32 )

[sub_resource type="AtlasTexture" id=6]
atlas = ExtResource( 1 )
region = Rect2( 48, 0, 16, 32 )

[sub_resource type="AtlasTexture" id=7]
atlas = ExtResource( 1 )
region = Rect2( 64, 0, 16, 32 )

[sub_resource type="AtlasTexture" id=8]
atlas = ExtResource( 1 )
region = Rect2( 80, 0, 16, 32 )

[sub_resource type="AtlasTexture" id=9]
atlas = ExtResource( 1 )
region = Rect2( 96, 0, 16, 32 )

[sub_resource type="AtlasTexture" id=10]
atlas = ExtResource( 1 )
region = Rect2( 112, 0, 16, 32 )

[sub_resource type="AtlasTexture" id=15]
atlas = ExtResource( 4 )
region = Rect2( 0, 0, 16, 32 )

[sub_resource type="AtlasTexture" id=16]
atlas = ExtResource( 4 )
region = Rect2( 16, 0, 16, 32 )

[sub_resource type="AtlasTexture" id=17]
atlas = ExtResource( 4 )
region = Rect2( 32, 0, 16, 32 )

[sub_resource type="AtlasTexture" id=18]
atlas = ExtResource( 4 )
region = Rect2( 48, 0, 16, 32 )

[sub_resource type="AtlasTexture" id=19]
atlas = ExtResource( 4 )
region = Rect2( 64, 0, 16, 32 )

[sub_resource type="AtlasTexture" id=20]
atlas = ExtResource( 4 )
region = Rect2( 80, 0, 16, 32 )

[sub_resource type="AtlasTexture" id=21]
atlas = ExtResource( 4 )
region = Rect2( 96, 0, 16, 32 )

[sub_resource type="AtlasTexture" id=22]
atlas = ExtResource( 4 )
region = Rect2( 112, 0, 16, 32 )

[sub_resource type="AtlasTexture" id=11]
atlas = ExtResource( 2 )
region = Rect2( 0, 0, 16, 32 )

[sub_resource type="AtlasTexture" id=12]
atlas = ExtResource( 2 )
region = Rect2( 16, 0, 16, 32 )

[sub_resource type="AtlasTexture" id=13]
atlas = ExtResource( 3 )
region = Rect2( 0, 0, 16, 32 )

[sub_resource type="AtlasTexture" id=14]
atlas = ExtResource( 3 )
region = Rect2( 16, 0, 16, 32 )

[resource]
animations = [ {
"frames": [ SubResource( 1 ), SubResource( 2 ), SubResource( 3 ), SubResource( 4 ), SubResource( 5 ), SubResource( 6 ), SubResource( 7 ), SubResource( 8 ), SubResource( 9 ), SubResource( 10 ) ],
"loop": true,
"name": "idle",
"speed": 1.0
}, {
"frames": [ SubResource( 15 ), SubResource( 16 ), SubResource( 17 ), SubResource( 18 ), SubResource( 19 ), SubResource( 20 ), SubResource( 21 ), SubResource( 22 ) ],
"loop": true,
"name": "idle_up",
"speed": 5.0
}, {
"frames": [ SubResource( 11 ), SubResource( 12 ) ],
"loop": true,
"name": "walking_down",
"speed": 4.0
}, {
"frames": [ SubResource( 13 ), SubResource( 14 ) ],
"loop": true,
"name": "walking_up",
"speed": 4.0
} ]
