[gd_scene load_steps=5 format=2]

[ext_resource path="res://src/Item/HandItem/_HandItem.tscn" type="PackedScene" id=1]
[ext_resource path="res://assets/Items/shepherdStaff.png" type="Texture" id=2]

[sub_resource type="AtlasTexture" id=1]
atlas = ExtResource( 2 )
region = Rect2( 0, 0, 16, 16 )

[sub_resource type="SpriteFrames" id=2]
animations = [ {
"frames": [ SubResource( 1 ) ],
"loop": true,
"name": "default",
"speed": 5.0
} ]

[node name="Staff" instance=ExtResource( 1 )]
bullet_path = "res://src/Projectile/Enemy/Slash.tscn"
cooldown = 0.6

[node name="Sprite" parent="." index="0"]
position = Vector2( 0, -7 )
frames = SubResource( 2 )

[node name="ItemDescription" parent="ZHolder" index="0"]
bbcode_text = "[color=yellow]Hůl[/color]
- Nenadchne
- Neurazí"
text = "Hůl
- Nenadchne
- Neurazí"
