[gd_resource type="StyleBoxFlat" format=2]

[resource]
content_margin_left = 12.0
content_margin_right = 8.0
content_margin_top = 8.0
content_margin_bottom = 8.0
bg_color = Color( 0.0352941, 0.0352941, 0.0352941, 0.933333 )
border_width_left = 4
border_width_top = 4
border_width_right = 4
border_width_bottom = 4
border_color = Color( 0.137255, 0.137255, 0.137255, 1 )
shadow_color = Color( 0, 0, 0, 0.694118 )
