[gd_scene load_steps=5 format=2]

[ext_resource path="res://src/Item/_Item.tscn" type="PackedScene" id=1]
[ext_resource path="res://assets/Items/cigarko.png" type="Texture" id=2]

[sub_resource type="AtlasTexture" id=1]
atlas = ExtResource( 2 )
region = Rect2( 80, 0, 16, 16 )

[sub_resource type="SpriteFrames" id=2]
animations = [ {
"frames": [ SubResource( 1 ) ],
"loop": true,
"name": "default",
"speed": 5.0
} ]

[node name="Item" instance=ExtResource( 1 )]

[node name="Sprite" parent="." index="0"]
position = Vector2( 0, -1 )
frames = SubResource( 2 )

[node name="ItemDescription" parent="ZHolder" index="0"]
bbcode_text = "[color=yellow]Vajgl[/color]
- Poslední potah nech žebrákům"
text = "Vajgl
- Poslední potah nech žebrákům"

[node name="Shadow" parent="." index="4"]
visible = false
