[gd_scene load_steps=9 format=2]

[ext_resource path="res://src/Map/HelperObjects/Area/Field.tscn" type="PackedScene" id=1]
[ext_resource path="res://assets/floor.tres" type="TileSet" id=2]
[ext_resource path="res://src/Map/Map.gd" type="Script" id=3]
[ext_resource path="res://src/Player/Player.tscn" type="PackedScene" id=4]
[ext_resource path="res://assets/vertical_base.tres" type="TileSet" id=5]
[ext_resource path="res://src/Map/HelperObjects/Area/Pub.tscn" type="PackedScene" id=6]
[ext_resource path="res://src/Map/HelperObjects/Switcher/MapSwitcher.tscn" type="PackedScene" id=7]
[ext_resource path="res://src/Npc/Serf/Serf.tscn" type="PackedScene" id=8]

[node name="Map" type="Node2D"]
script = ExtResource( 3 )

[node name="Nav" type="Navigation2D" parent="."]

[node name="Ground" type="TileMap" parent="Nav"]
tile_set = ExtResource( 2 )
cell_size = Vector2( 16, 16 )
bake_navigation = true
format = 1
tile_data = PoolIntArray( 24, 24, 0, 25, 24, 0, 26, 24, 0, 27, 24, 0, 28, 24, 0, 29, 24, 0, 30, 24, 0, 31, 24, 0, 32, 24, 0, 33, 24, 0, 34, 24, 0, 35, 24, 0, 36, 24, 0, 37, 24, 0, 38, 24, 0, 39, 1, 0, 40, 1, 0, 41, 24, 0, 42, 24, 0, 43, 24, 0, 44, 24, 0, 65553, 24, 0, 65554, 24, 0, 65555, 24, 0, 65556, 24, 0, 65557, 24, 0, 65558, 24, 0, 65560, 24, 0, 65561, 24, 0, 65562, 24, 0, 65563, 24, 0, 65564, 24, 0, 65565, 24, 0, 65566, 24, 0, 65567, 24, 0, 65568, 24, 0, 65569, 24, 0, 65570, 24, 0, 65571, 24, 0, 65572, 24, 0, 65573, 24, 0, 65574, 24, 0, 65575, 1, 0, 65576, 1, 0, 65577, 24, 0, 65578, 24, 0, 65579, 24, 0, 65580, 24, 0, 131088, 24, 0, 131089, 24, 0, 131090, 24, 0, 131091, 24, 0, 131092, 24, 0, 131093, 24, 0, 131094, 24, 0, 131095, 24, 0, 131096, 24, 0, 131097, 24, 0, 131098, 24, 0, 131099, 24, 0, 131100, 24, 0, 131101, 24, 0, 131102, 24, 0, 131103, 24, 0, 131104, 24, 0, 131105, 24, 0, 131106, 24, 0, 131107, 24, 0, 131108, 24, 0, 131109, 24, 0, 131110, 23, 0, 131111, 76, 0, 131112, 79, 0, 131113, 24, 0, 131114, 24, 0, 131115, 24, 0, 131116, 24, 0, 131117, 24, 0, 131118, 24, 0, 131119, 24, 0, 131120, 24, 0, 131121, 24, 0, 196618, 24, 0, 196619, 24, 0, 196620, 24, 0, 196621, 24, 0, 196622, 24, 0, 196623, 24, 0, 196624, 24, 0, 196625, 24, 0, 196626, 23, 0, 196627, 23, 0, 196628, 24, 0, 196629, 24, 0, 196630, 24, 0, 196631, 24, 0, 196632, 24, 0, 196633, 24, 0, 196634, 24, 0, 196635, 23, 0, 196636, 24, 0, 196637, 24, 0, 196638, 24, 0, 196639, 24, 0, 196640, 24, 0, 196641, 24, 0, 196642, 24, 0, 196643, 24, 0, 196644, 24, 0, 196645, 24, 0, 196646, 24, 0, 196647, 76, 0, 196648, 79, 0, 196649, 24, 0, 196650, 24, 0, 196651, 24, 0, 196652, 24, 0, 196653, 24, 0, 196654, 24, 0, 196655, 24, 0, 196656, 24, 0, 196657, 24, 0, 196658, 24, 0, 196659, 24, 0, 196660, 24, 0, 196663, 23, 0, 196664, 23, 0, 262154, 24, 0, 262155, 24, 0, 262156, 24, 0, 262157, 24, 0, 262158, 24, 0, 262159, 24, 0, 262160, 24, 0, 262161, 24, 0, 262162, 24, 0, 262163, 24, 0, 262164, 24, 0, 262165, 24, 0, 262166, 24, 0, 262167, 24, 0, 262168, 24, 0, 262169, 24, 0, 262170, 24, 0, 262171, 24, 0, 262172, 24, 0, 262173, 24, 0, 262174, 24, 0, 262175, 24, 0, 262176, 24, 0, 262177, 24, 0, 262178, 24, 0, 262179, 24, 0, 262180, 24, 0, 262181, 24, 0, 262182, 24, 0, 262183, 76, 0, 262184, 79, 0, 262185, 24, 0, 262186, 24, 0, 262187, 24, 0, 262188, 24, 0, 262189, 24, 0, 262190, 24, 0, 262191, 24, 0, 262192, 24, 0, 262193, 24, 0, 262194, 24, 0, 262195, 24, 0, 262196, 24, 0, 262197, 24, 0, 327690, 24, 0, 327691, 24, 0, 327692, 24, 0, 327693, 24, 0, 327694, 24, 0, 327695, 24, 0, 327696, 24, 0, 327697, 24, 0, 327698, 24, 0, 327699, 24, 0, 327700, 24, 0, 327701, 24, 0, 327702, 24, 0, 327703, 24, 0, 327704, 24, 0, 327705, 24, 0, 327706, 24, 0, 327707, 24, 0, 327708, 24, 0, 327709, 24, 0, 327710, 24, 0, 327711, 24, 0, 327712, 24, 0, 327713, 24, 0, 327714, 24, 0, 327715, 24, 0, 327716, 24, 0, 327717, 24, 0, 327718, 24, 0, 327719, 76, 0, 327720, 79, 0, 327721, 24, 0, 327722, 24, 0, 327723, 24, 0, 327724, 24, 0, 327725, 24, 0, 327726, 24, 0, 327727, 24, 0, 327728, 24, 0, 327729, 24, 0, 327730, 24, 0, 327731, 24, 0, 327732, 24, 0, 327733, 24, 0, 327734, 24, 0, 327735, 24, 0, 327736, 24, 0, 393224, 24, 0, 393225, 24, 0, 393226, 24, 0, 393227, 24, 0, 393228, 24, 0, 393229, 24, 0, 393230, 24, 0, 393231, 24, 0, 393232, 24, 0, 393233, 24, 0, 393234, 24, 0, 393235, 24, 0, 393236, 24, 0, 393237, 24, 0, 393238, 24, 0, 393239, 24, 0, 393240, 24, 0, 393241, 24, 0, 393242, 24, 0, 393243, 24, 0, 393244, 24, 0, 393245, 24, 0, 393246, 24, 0, 393247, 24, 0, 393248, 23, 0, 393249, 24, 0, 393250, 24, 0, 393251, 24, 0, 393252, 24, 0, 393253, 24, 0, 393254, 24, 0, 393255, 76, 0, 393256, 79, 0, 393257, 24, 0, 393258, 24, 0, 393259, 24, 0, 393260, 24, 0, 393261, 24, 0, 393262, 24, 0, 393263, 24, 0, 393264, 24, 0, 393265, 24, 0, 393266, 24, 0, 393267, 24, 0, 393268, 24, 0, 393269, 24, 0, 393270, 24, 0, 393271, 24, 0, 393272, 24, 0, 393273, 24, 0, 393274, 24, 0, 393275, 24, 0, 458760, 24, 0, 458761, 24, 0, 458762, 24, 0, 458763, 24, 0, 458764, 24, 0, 458765, 24, 0, 458766, 24, 0, 458767, 24, 0, 458768, 24, 0, 458769, 24, 0, 458770, 24, 0, 458771, 24, 0, 458772, 24, 0, 458773, 24, 0, 458774, 24, 0, 458775, 24, 0, 458776, 24, 0, 458777, 24, 0, 458778, 24, 0, 458779, 24, 0, 458780, 24, 0, 458781, 24, 0, 458782, 24, 0, 458783, 24, 0, 458784, 24, 0, 458785, 24, 0, 458786, 24, 0, 458787, 24, 0, 458788, 24, 0, 458789, 24, 0, 458790, 24, 0, 458791, 76, 0, 458792, 79, 0, 458793, 24, 0, 458794, 24, 0, 458795, 24, 0, 458796, 24, 0, 458797, 24, 0, 458798, 23, 0, 458799, 24, 0, 458800, 24, 0, 458801, 24, 0, 458802, 24, 0, 458803, 24, 0, 458804, 24, 0, 458805, 24, 0, 458806, 24, 0, 458807, 24, 0, 458808, 24, 0, 458809, 24, 0, 458810, 24, 0, 458811, 24, 0, 458812, 24, 0, 458813, 24, 0, 458814, 24, 0, 524296, 24, 0, 524297, 24, 0, 524298, 24, 0, 524299, 24, 0, 524300, 24, 0, 524301, 24, 0, 524302, 24, 0, 524303, 24, 0, 524304, 24, 0, 524305, 24, 0, 524306, 24, 0, 524307, 24, 0, 524308, 24, 0, 524309, 24, 0, 524310, 24, 0, 524311, 24, 0, 524312, 24, 0, 524313, 23, 0, 524314, 24, 0, 524315, 24, 0, 524316, 24, 0, 524317, 24, 0, 524318, 24, 0, 524319, 24, 0, 524320, 24, 0, 524321, 24, 0, 524322, 24, 0, 524323, 24, 0, 524324, 24, 0, 524325, 24, 0, 524326, 24, 0, 524327, 76, 0, 524328, 79, 0, 524329, 24, 0, 524330, 24, 0, 524331, 24, 0, 524332, 24, 0, 524333, 24, 0, 524334, 24, 0, 524335, 24, 0, 524336, 24, 0, 524337, 24, 0, 524338, 24, 0, 524339, 24, 0, 524340, 24, 0, 524341, 24, 0, 524342, 24, 0, 524343, 24, 0, 524344, 24, 0, 524345, 24, 0, 524346, 24, 0, 524347, 24, 0, 524348, 24, 0, 524349, 24, 0, 524350, 24, 0, 589832, 24, 0, 589833, 24, 0, 589834, 24, 0, 589835, 24, 0, 589836, 24, 0, 589837, 24, 0, 589838, 24, 0, 589839, 24, 0, 589840, 24, 0, 589841, 24, 0, 589842, 24, 0, 589843, 24, 0, 589844, 24, 0, 589845, 24, 0, 589846, 24, 0, 589847, 24, 0, 589848, 24, 0, 589849, 23, 0, 589850, 24, 0, 589851, 24, 0, 589852, 24, 0, 589853, 23, 0, 589854, 24, 0, 589855, 24, 0, 589856, 24, 0, 589857, 24, 0, 589858, 24, 0, 589859, 24, 0, 589860, 24, 0, 589861, 24, 0, 589862, 24, 0, 589863, 76, 0, 589864, 79, 0, 589865, 24, 0, 589866, 24, 0, 589867, 24, 0, 589868, 24, 0, 589869, 24, 0, 589870, 24, 0, 589871, 24, 0, 589872, 24, 0, 589873, 24, 0, 589874, 24, 0, 589875, 24, 0, 589876, 24, 0, 589877, 24, 0, 589878, 24, 0, 589879, 24, 0, 589880, 24, 0, 589881, 24, 0, 589882, 24, 0, 589883, 24, 0, 589884, 24, 0, 589885, 24, 0, 589886, 24, 0, 589887, 24, 0, 655368, 24, 0, 655369, 24, 0, 655370, 24, 0, 655371, 24, 0, 655372, 24, 0, 655373, 24, 0, 655374, 24, 0, 655375, 24, 0, 655376, 24, 0, 655377, 24, 0, 655378, 24, 0, 655379, 24, 0, 655380, 24, 0, 655381, 23, 0, 655382, 24, 0, 655383, 24, 0, 655384, 24, 0, 655385, 24, 0, 655386, 24, 0, 655387, 24, 0, 655388, 24, 0, 655389, 24, 0, 655390, 24, 0, 655391, 24, 0, 655392, 24, 0, 655393, 24, 0, 655394, 24, 0, 655395, 24, 0, 655396, 24, 0, 655397, 24, 0, 655398, 24, 0, 655399, 76, 0, 655400, 79, 0, 655401, 23, 0, 655402, 24, 0, 655403, 23, 0, 655404, 24, 0, 655405, 24, 0, 655406, 24, 0, 655407, 74, 0, 655408, 75, 0, 655409, 78, 0, 655410, 24, 0, 655411, 24, 0, 655412, 24, 0, 655413, 24, 0, 655414, 24, 0, 655415, 24, 0, 655416, 24, 0, 655417, 24, 0, 655418, 24, 0, 655419, 24, 0, 655420, 23, 0, 655421, 24, 0, 655422, 24, 0, 655423, 24, 0, 655424, 24, 0, 720902, 24, 0, 720903, 24, 0, 720904, 24, 0, 720905, 24, 0, 720906, 24, 0, 720907, 24, 0, 720908, 24, 0, 720909, 24, 0, 720910, 24, 0, 720911, 24, 0, 720912, 24, 0, 720913, 24, 0, 720914, 24, 0, 720915, 24, 0, 720916, 24, 0, 720917, 24, 0, 720918, 24, 0, 720919, 24, 0, 720920, 24, 0, 720921, 24, 0, 720922, 24, 0, 720923, 24, 0, 720924, 24, 0, 720925, 24, 0, 720926, 24, 0, 720927, 24, 0, 720928, 24, 0, 720929, 24, 0, 720930, 24, 0, 720931, 24, 0, 720932, 24, 0, 720933, 24, 0, 720934, 24, 0, 720935, 76, 0, 720936, 77, 0, 720937, 75, 0, 720938, 75, 0, 720939, 75, 0, 720940, 75, 0, 720941, 75, 0, 720942, 75, 0, 720943, 77, 0, 720944, 77, 0, 720945, 77, 0, 720946, 78, 0, 720947, 24, 0, 720948, 24, 0, 720949, 24, 0, 720950, 24, 0, 720951, 23, 0, 720952, 24, 0, 720953, 24, 0, 720954, 24, 0, 720955, 24, 0, 720956, 24, 0, 720957, 24, 0, 720958, 24, 0, 720959, 24, 0, 720960, 24, 0, 720961, 24, 0, 720962, 24, 0, 720963, 24, 0, 786437, 24, 0, 786438, 24, 0, 786439, 24, 0, 786440, 24, 0, 786441, 24, 0, 786442, 24, 0, 786443, 24, 0, 786444, 24, 0, 786445, 24, 0, 786446, 24, 0, 786447, 24, 0, 786448, 24, 0, 786449, 23, 0, 786450, 24, 0, 786451, 24, 0, 786452, 24, 0, 786453, 24, 0, 786454, 24, 0, 786455, 24, 0, 786456, 24, 0, 786457, 24, 0, 786458, 24, 0, 786459, 24, 0, 786460, 24, 0, 786461, 24, 0, 786462, 24, 0, 786463, 24, 0, 786464, 24, 0, 786465, 24, 0, 786466, 24, 0, 786467, 24, 0, 786468, 24, 0, 786469, 24, 0, 786470, 24, 0, 786471, 76, 0, 786472, 77, 0, 786473, 81, 0, 786474, 81, 0, 786475, 81, 0, 786476, 81, 0, 786477, 81, 0, 786478, 81, 0, 786479, 81, 0, 786480, 77, 0, 786481, 77, 0, 786482, 82, 0, 786483, 24, 0, 786484, 24, 0, 786485, 24, 0, 786486, 24, 0, 786487, 24, 0, 786488, 24, 0, 786489, 24, 0, 786490, 24, 0, 786491, 24, 0, 786492, 24, 0, 786493, 24, 0, 786494, 24, 0, 786495, 24, 0, 786496, 24, 0, 786497, 24, 0, 786498, 24, 0, 786499, 24, 0, 786500, 24, 0, 851973, 24, 0, 851974, 24, 0, 851975, 24, 0, 851976, 24, 0, 851977, 23, 0, 851978, 24, 0, 851979, 24, 0, 851980, 24, 0, 851981, 24, 0, 851982, 24, 0, 851983, 24, 0, 851984, 24, 0, 851985, 24, 0, 851986, 24, 0, 851987, 24, 0, 851988, 24, 0, 851989, 24, 0, 851990, 24, 0, 851991, 24, 0, 851992, 24, 0, 851993, 24, 0, 851994, 24, 0, 851995, 24, 0, 851996, 24, 0, 851997, 24, 0, 851998, 24, 0, 851999, 24, 0, 852000, 24, 0, 852001, 24, 0, 852002, 24, 0, 852003, 24, 0, 852004, 24, 0, 852005, 24, 0, 852006, 24, 0, 852007, 76, 0, 852008, 79, 0, 852009, 24, 0, 852010, 24, 0, 852011, 24, 0, 852012, 24, 0, 852013, 24, 0, 852014, 24, 0, 852015, 24, 0, 852016, 80, 0, 852017, 81, 0, 852018, 24, 0, 852019, 24, 0, 852020, 23, 0, 852021, 24, 0, 852022, 24, 0, 852023, 24, 0, 852024, 24, 0, 852025, 24, 0, 852026, 24, 0, 852027, 24, 0, 852028, 24, 0, 852029, 24, 0, 852030, 23, 0, 852031, 23, 0, 852032, 24, 0, 852033, 24, 0, 852034, 24, 0, 852035, 24, 0, 852036, 24, 0, 917509, 24, 0, 917510, 24, 0, 917511, 24, 0, 917512, 24, 0, 917513, 24, 0, 917514, 24, 0, 917515, 24, 0, 917516, 24, 0, 917517, 24, 0, 917518, 24, 0, 917519, 24, 0, 917520, 24, 0, 917521, 24, 0, 917522, 24, 0, 917523, 24, 0, 917524, 24, 0, 917525, 24, 0, 917526, 24, 0, 917527, 24, 0, 917528, 24, 0, 917529, 24, 0, 917530, 24, 0, 917531, 24, 0, 917532, 24, 0, 917533, 24, 0, 917534, 24, 0, 917535, 24, 0, 917536, 24, 0, 917537, 24, 0, 917538, 24, 0, 917539, 24, 0, 917540, 24, 0, 917541, 24, 0, 917542, 24, 0, 917543, 76, 0, 917544, 79, 0, 917545, 24, 0, 917546, 24, 0, 917547, 24, 0, 917548, 24, 0, 917549, 24, 0, 917550, 24, 0, 917551, 24, 0, 917552, 24, 0, 917553, 24, 0, 917554, 24, 0, 917555, 24, 0, 917556, 24, 0, 917557, 24, 0, 917558, 24, 0, 917559, 24, 0, 917560, 24, 0, 917561, 24, 0, 917562, 24, 0, 917563, 24, 0, 917564, 24, 0, 917565, 24, 0, 917566, 24, 0, 917567, 24, 0, 917568, 24, 0, 917569, 24, 0, 917570, 24, 0, 917571, 24, 0, 917572, 24, 0, 917573, 24, 0, 983045, 24, 0, 983046, 24, 0, 983047, 24, 0, 983048, 24, 0, 983049, 24, 0, 983050, 24, 0, 983051, 24, 0, 983052, 24, 0, 983053, 24, 0, 983054, 24, 0, 983055, 24, 0, 983056, 24, 0, 983057, 24, 0, 983058, 24, 0, 983059, 24, 0, 983060, 24, 0, 983061, 24, 0, 983062, 24, 0, 983063, 24, 0, 983064, 24, 0, 983065, 24, 0, 983066, 24, 0, 983067, 24, 0, 983068, 24, 0, 983069, 24, 0, 983070, 24, 0, 983071, 24, 0, 983072, 24, 0, 983073, 24, 0, 983074, 24, 0, 983075, 23, 0, 983076, 24, 0, 983077, 24, 0, 983078, 24, 0, 983079, 76, 0, 983080, 79, 0, 983081, 24, 0, 983082, 24, 0, 983083, 24, 0, 983084, 24, 0, 983085, 24, 0, 983086, 24, 0, 983087, 24, 0, 983088, 24, 0, 983089, 24, 0, 983090, 24, 0, 983091, 24, 0, 983092, 24, 0, 983093, 24, 0, 983094, 24, 0, 983095, 24, 0, 983096, 24, 0, 983097, 24, 0, 983098, 24, 0, 983099, 24, 0, 983100, 24, 0, 983101, 24, 0, 983102, 24, 0, 983103, 24, 0, 983104, 24, 0, 983105, 24, 0, 983106, 24, 0, 983107, 24, 0, 983108, 24, 0, 983109, 24, 0, 983110, 24, 0, 1048581, 24, 0, 1048582, 24, 0, 1048583, 24, 0, 1048584, 24, 0, 1048585, 24, 0, 1048586, 24, 0, 1048587, 24, 0, 1048588, 24, 0, 1048589, 24, 0, 1048590, 24, 0, 1048591, 24, 0, 1048592, 24, 0, 1048593, 24, 0, 1048594, 24, 0, 1048595, 24, 0, 1048596, 24, 0, 1048597, 24, 0, 1048598, 23, 0, 1048599, 24, 0, 1048600, 24, 0, 1048601, 24, 0, 1048602, 24, 0, 1048603, 24, 0, 1048604, 24, 0, 1048605, 24, 0, 1048606, 24, 0, 1048607, 24, 0, 1048608, 24, 0, 1048609, 24, 0, 1048610, 24, 0, 1048611, 24, 0, 1048612, 24, 0, 1048613, 24, 0, 1048614, 24, 0, 1048615, 76, 0, 1048616, 79, 0, 1048617, 24, 0, 1048618, 24, 0, 1048619, 24, 0, 1048620, 24, 0, 1048621, 24, 0, 1048622, 24, 0, 1048623, 24, 0, 1048624, 24, 0, 1048625, 24, 0, 1048626, 24, 0, 1048627, 24, 0, 1048628, 24, 0, 1048629, 24, 0, 1048630, 24, 0, 1048631, 24, 0, 1048632, 24, 0, 1048633, 24, 0, 1048634, 24, 0, 1048635, 24, 0, 1048636, 24, 0, 1048637, 24, 0, 1048638, 24, 0, 1048639, 24, 0, 1048640, 24, 0, 1048641, 24, 0, 1048642, 24, 0, 1048643, 24, 0, 1048644, 24, 0, 1048645, 24, 0, 1048646, 24, 0, 1048647, 24, 0, 1048648, 24, 0, 1048649, 24, 0, 1114119, 23, 0, 1114120, 24, 0, 1114121, 24, 0, 1114122, 24, 0, 1114123, 24, 0, 1114124, 24, 0, 1114125, 24, 0, 1114126, 24, 0, 1114127, 24, 0, 1114128, 24, 0, 1114129, 24, 0, 1114130, 24, 0, 1114131, 24, 0, 1114132, 24, 0, 1114133, 24, 0, 1114134, 24, 0, 1114135, 24, 0, 1114136, 24, 0, 1114137, 24, 0, 1114138, 24, 0, 1114139, 24, 0, 1114140, 24, 0, 1114141, 24, 0, 1114142, 23, 0, 1114143, 24, 0, 1114144, 24, 0, 1114145, 24, 0, 1114146, 24, 0, 1114147, 24, 0, 1114148, 24, 0, 1114149, 24, 0, 1114150, 24, 0, 1114151, 76, 0, 1114152, 79, 0, 1114153, 24, 0, 1114154, 24, 0, 1114155, 24, 0, 1114156, 24, 0, 1114157, 24, 0, 1114158, 23, 0, 1114159, 24, 0, 1114160, 24, 0, 1114161, 24, 0, 1114162, 24, 0, 1114163, 24, 0, 1114164, 24, 0, 1114165, 24, 0, 1114166, 24, 0, 1114167, 24, 0, 1114168, 24, 0, 1114169, 24, 0, 1114170, 24, 0, 1114171, 24, 0, 1114172, 24, 0, 1114173, 24, 0, 1114174, 24, 0, 1114175, 24, 0, 1114176, 24, 0, 1114177, 24, 0, 1114178, 24, 0, 1114179, 24, 0, 1114180, 24, 0, 1114181, 24, 0, 1114182, 24, 0, 1114183, 24, 0, 1114184, 24, 0, 1114185, 24, 0, 1179655, 23, 0, 1179656, 24, 0, 1179657, 24, 0, 1179658, 24, 0, 1179659, 24, 0, 1179660, 24, 0, 1179661, 24, 0, 1179662, 23, 0, 1179663, 24, 0, 1179664, 24, 0, 1179665, 24, 0, 1179666, 24, 0, 1179667, 24, 0, 1179668, 24, 0, 1179669, 24, 0, 1179670, 24, 0, 1179671, 24, 0, 1179672, 24, 0, 1179673, 24, 0, 1179674, 24, 0, 1179675, 24, 0, 1179676, 24, 0, 1179677, 24, 0, 1179678, 24, 0, 1179679, 24, 0, 1179680, 24, 0, 1179681, 24, 0, 1179682, 24, 0, 1179683, 24, 0, 1179684, 24, 0, 1179685, 24, 0, 1179686, 24, 0, 1179687, 76, 0, 1179688, 79, 0, 1179689, 24, 0, 1179690, 24, 0, 1179691, 24, 0, 1179692, 24, 0, 1179693, 24, 0, 1179694, 24, 0, 1179695, 24, 0, 1179696, 24, 0, 1179697, 24, 0, 1179698, 24, 0, 1179699, 24, 0, 1179700, 24, 0, 1179701, 24, 0, 1179702, 24, 0, 1179703, 24, 0, 1179704, 24, 0, 1179705, 24, 0, 1179706, 24, 0, 1179707, 24, 0, 1179708, 24, 0, 1179709, 24, 0, 1179710, 24, 0, 1179711, 24, 0, 1179712, 24, 0, 1179713, 24, 0, 1179714, 24, 0, 1179715, 24, 0, 1179716, 24, 0, 1179717, 24, 0, 1179718, 24, 0, 1179719, 24, 0, 1179720, 24, 0, 1179721, 24, 0, 1179722, 24, 0, 1245197, 24, 0, 1245198, 24, 0, 1245199, 24, 0, 1245200, 24, 0, 1245201, 24, 0, 1245202, 24, 0, 1245203, 24, 0, 1245204, 24, 0, 1245205, 24, 0, 1245206, 24, 0, 1245207, 24, 0, 1245208, 24, 0, 1245209, 24, 0, 1245210, 24, 0, 1245211, 24, 0, 1245212, 24, 0, 1245213, 24, 0, 1245214, 24, 0, 1245215, 24, 0, 1245216, 24, 0, 1245217, 24, 0, 1245218, 24, 0, 1245219, 24, 0, 1245220, 24, 0, 1245221, 24, 0, 1245222, 24, 0, 1245223, 76, 0, 1245224, 79, 0, 1245225, 24, 0, 1245226, 24, 0, 1245227, 24, 0, 1245228, 24, 0, 1245229, 24, 0, 1245230, 24, 0, 1245231, 24, 0, 1245232, 24, 0, 1245233, 24, 0, 1245234, 24, 0, 1245235, 24, 0, 1245236, 24, 0, 1245237, 24, 0, 1245238, 24, 0, 1245239, 24, 0, 1245240, 24, 0, 1245241, 24, 0, 1245242, 24, 0, 1245243, 24, 0, 1245244, 24, 0, 1245245, 23, 0, 1245246, 24, 0, 1245247, 24, 0, 1245248, 24, 0, 1245249, 24, 0, 1245250, 24, 0, 1245251, 24, 0, 1245252, 24, 0, 1245253, 24, 0, 1245254, 24, 0, 1245255, 24, 0, 1245256, 24, 0, 1245257, 24, 0, 1245258, 24, 0, 1310732, 24, 0, 1310733, 24, 0, 1310734, 24, 0, 1310735, 24, 0, 1310736, 24, 0, 1310737, 24, 0, 1310738, 24, 0, 1310739, 24, 0, 1310740, 24, 0, 1310741, 24, 0, 1310742, 24, 0, 1310743, 24, 0, 1310744, 24, 0, 1310745, 24, 0, 1310746, 24, 0, 1310747, 24, 0, 1310748, 24, 0, 1310749, 24, 0, 1310750, 24, 0, 1310751, 24, 0, 1310752, 24, 0, 1310753, 24, 0, 1310754, 24, 0, 1310755, 24, 0, 1310756, 24, 0, 1310757, 24, 0, 1310758, 24, 0, 1310759, 76, 0, 1310760, 79, 0, 1310761, 24, 0, 1310762, 24, 0, 1310763, 24, 0, 1310764, 24, 0, 1310765, 24, 0, 1310766, 24, 0, 1310767, 24, 0, 1310768, 24, 0, 1310769, 24, 0, 1310770, 24, 0, 1310771, 24, 0, 1310772, 24, 0, 1310773, 24, 0, 1310774, 24, 0, 1310775, 24, 0, 1310776, 24, 0, 1310777, 24, 0, 1310778, 24, 0, 1310779, 24, 0, 1310780, 24, 0, 1310781, 24, 0, 1310782, 24, 0, 1310783, 24, 0, 1310784, 24, 0, 1310785, 24, 0, 1310786, 24, 0, 1310787, 24, 0, 1310788, 24, 0, 1310789, 23, 0, 1310790, 23, 0, 1310791, 24, 0, 1310792, 24, 0, 1310793, 24, 0, 1310794, 24, 0, 1310795, 24, 0, 1376267, 24, 0, 1376268, 24, 0, 1376269, 24, 0, 1376270, 24, 0, 1376271, 24, 0, 1376272, 24, 0, 1376273, 24, 0, 1376274, 24, 0, 1376275, 24, 0, 1376276, 24, 0, 1376277, 24, 0, 1376278, 24, 0, 1376279, 24, 0, 1376280, 24, 0, 1376281, 24, 0, 1376282, 24, 0, 1376283, 24, 0, 1376284, 23, 0, 1376285, 24, 0, 1376286, 24, 0, 1376287, 24, 0, 1376288, 24, 0, 1376289, 24, 0, 1376290, 24, 0, 1376291, 24, 0, 1376292, 24, 0, 1376293, 24, 0, 1376294, 24, 0, 1376295, 76, 0, 1376296, 79, 0, 1376297, 24, 0, 1376298, 24, 0, 1376299, 24, 0, 1376300, 24, 0, 1376301, 24, 0, 1376302, 24, 0, 1376303, 24, 0, 1376304, 24, 0, 1376305, 24, 0, 1376306, 24, 0, 1376307, 24, 0, 1376308, 24, 0, 1376309, 24, 0, 1376310, 24, 0, 1376311, 24, 0, 1376312, 24, 0, 1376313, 24, 0, 1376314, 24, 0, 1376315, 24, 0, 1376316, 24, 0, 1376317, 24, 0, 1376318, 24, 0, 1376319, 24, 0, 1376320, 24, 0, 1376321, 24, 0, 1376322, 24, 0, 1376323, 24, 0, 1376324, 24, 0, 1376325, 24, 0, 1376326, 24, 0, 1376327, 24, 0, 1376328, 24, 0, 1376329, 24, 0, 1376330, 24, 0, 1376331, 24, 0, 1376332, 24, 0, 1441803, 24, 0, 1441804, 24, 0, 1441805, 24, 0, 1441806, 24, 0, 1441807, 24, 0, 1441808, 24, 0, 1441809, 24, 0, 1441810, 24, 0, 1441811, 24, 0, 1441812, 24, 0, 1441813, 24, 0, 1441814, 24, 0, 1441815, 24, 0, 1441816, 24, 0, 1441817, 24, 0, 1441818, 24, 0, 1441819, 24, 0, 1441820, 24, 0, 1441821, 24, 0, 1441822, 24, 0, 1441823, 24, 0, 1441824, 24, 0, 1441825, 24, 0, 1441826, 24, 0, 1441827, 24, 0, 1441828, 24, 0, 1441829, 24, 0, 1441830, 23, 0, 1441831, 76, 0, 1441832, 79, 0, 1441833, 24, 0, 1441834, 24, 0, 1441835, 24, 0, 1441836, 23, 0, 1441837, 24, 0, 1441838, 24, 0, 1441839, 24, 0, 1441840, 24, 0, 1441841, 24, 0, 1441842, 24, 0, 1441843, 24, 0, 1441844, 24, 0, 1441845, 24, 0, 1441846, 24, 0, 1441847, 23, 0, 1441848, 23, 0, 1441849, 24, 0, 1441850, 24, 0, 1441851, 24, 0, 1441852, 24, 0, 1441853, 24, 0, 1441854, 24, 0, 1441855, 24, 0, 1441856, 24, 0, 1441857, 24, 0, 1441858, 24, 0, 1441859, 24, 0, 1441860, 24, 0, 1441861, 24, 0, 1441862, 24, 0, 1441863, 24, 0, 1441864, 24, 0, 1441865, 24, 0, 1441866, 24, 0, 1441867, 24, 0, 1441868, 24, 0, 1507339, 24, 0, 1507340, 24, 0, 1507341, 24, 0, 1507342, 24, 0, 1507343, 24, 0, 1507344, 24, 0, 1507345, 24, 0, 1507346, 24, 0, 1507347, 24, 0, 1507348, 24, 0, 1507349, 24, 0, 1507350, 24, 0, 1507351, 24, 0, 1507352, 24, 0, 1507353, 24, 0, 1507354, 24, 0, 1507355, 24, 0, 1507356, 24, 0, 1507357, 24, 0, 1507358, 24, 0, 1507359, 24, 0, 1507360, 24, 0, 1507361, 24, 0, 1507362, 24, 0, 1507363, 24, 0, 1507364, 24, 0, 1507365, 24, 0, 1507366, 24, 0, 1507367, 76, 0, 1507368, 79, 0, 1507369, 24, 0, 1507370, 24, 0, 1507371, 24, 0, 1507372, 24, 0, 1507373, 24, 0, 1507374, 24, 0, 1507375, 24, 0, 1507376, 24, 0, 1507377, 24, 0, 1507378, 24, 0, 1507379, 24, 0, 1507380, 24, 0, 1507381, 24, 0, 1507382, 24, 0, 1507383, 24, 0, 1507384, 24, 0, 1507385, 24, 0, 1507386, 24, 0, 1507387, 24, 0, 1507388, 24, 0, 1507389, 24, 0, 1507390, 24, 0, 1507391, 24, 0, 1507392, 24, 0, 1507393, 24, 0, 1507394, 24, 0, 1507395, 24, 0, 1507396, 24, 0, 1507397, 24, 0, 1507398, 24, 0, 1507399, 24, 0, 1507400, 24, 0, 1507401, 24, 0, 1507402, 24, 0, 1507403, 24, 0, 1507404, 24, 0, 1507405, 24, 0, 1507406, 24, 0, 1572875, 24, 0, 1572876, 24, 0, 1572877, 24, 0, 1572878, 24, 0, 1572879, 24, 0, 1572880, 24, 0, 1572881, 24, 0, 1572882, 24, 0, 1572883, 23, 0, 1572884, 24, 0, 1572885, 24, 0, 1572886, 24, 0, 1572887, 24, 0, 1572888, 24, 0, 1572889, 24, 0, 1572890, 24, 0, 1572891, 24, 0, 1572892, 24, 0, 1572893, 24, 0, 1572894, 24, 0, 1572895, 24, 0, 1572896, 24, 0, 1572897, 24, 0, 1572898, 24, 0, 1572899, 24, 0, 1572900, 24, 0, 1572901, 24, 0, 1572902, 24, 0, 1572903, 76, 0, 1572904, 79, 0, 1572905, 24, 0, 1572906, 24, 0, 1572907, 24, 0, 1572908, 24, 0, 1572909, 24, 0, 1572910, 24, 0, 1572911, 24, 0, 1572912, 24, 0, 1572913, 24, 0, 1572914, 24, 0, 1572915, 24, 0, 1572916, 24, 0, 1572917, 24, 0, 1572918, 24, 0, 1572919, 24, 0, 1572920, 24, 0, 1572921, 24, 0, 1572922, 24, 0, 1572923, 24, 0, 1572924, 24, 0, 1572925, 24, 0, 1572926, 24, 0, 1572927, 24, 0, 1572928, 24, 0, 1572929, 24, 0, 1572930, 24, 0, 1572931, 24, 0, 1572932, 24, 0, 1572933, 24, 0, 1572934, 24, 0, 1572935, 24, 0, 1572936, 24, 0, 1572937, 24, 0, 1572938, 24, 0, 1572939, 24, 0, 1572940, 24, 0, 1572941, 24, 0, 1572942, 24, 0, 1572943, 24, 0, 1638410, 24, 0, 1638411, 24, 0, 1638412, 24, 0, 1638413, 24, 0, 1638414, 24, 0, 1638415, 24, 0, 1638416, 24, 0, 1638417, 24, 0, 1638418, 24, 0, 1638419, 24, 0, 1638420, 24, 0, 1638421, 24, 0, 1638422, 24, 0, 1638423, 24, 0, 1638424, 24, 0, 1638425, 24, 0, 1638426, 24, 0, 1638427, 24, 0, 1638428, 24, 0, 1638429, 24, 0, 1638430, 24, 0, 1638431, 24, 0, 1638432, 24, 0, 1638433, 24, 0, 1638434, 24, 0, 1638435, 24, 0, 1638436, 24, 0, 1638437, 24, 0, 1638438, 24, 0, 1638439, 76, 0, 1638440, 79, 0, 1638441, 24, 0, 1638442, 24, 0, 1638443, 24, 0, 1638444, 24, 0, 1638445, 24, 0, 1638446, 24, 0, 1638447, 24, 0, 1638448, 24, 0, 1638449, 24, 0, 1638450, 24, 0, 1638451, 24, 0, 1638452, 24, 0, 1638453, 24, 0, 1638454, 24, 0, 1638455, 24, 0, 1638456, 24, 0, 1638457, 24, 0, 1638458, 24, 0, 1638459, 24, 0, 1638460, 24, 0, 1638461, 24, 0, 1638462, 24, 0, 1638463, 24, 0, 1638464, 24, 0, 1638465, 24, 0, 1638466, 24, 0, 1638467, 24, 0, 1638468, 24, 0, 1638469, 24, 0, 1638470, 24, 0, 1638471, 24, 0, 1638472, 24, 0, 1638473, 24, 0, 1638474, 24, 0, 1638475, 24, 0, 1638476, 24, 0, 1638477, 24, 0, 1638478, 24, 0, 1638479, 24, 0, 1703944, 24, 0, 1703945, 24, 0, 1703946, 24, 0, 1703947, 24, 0, 1703948, 24, 0, 1703949, 24, 0, 1703950, 24, 0, 1703951, 24, 0, 1703952, 24, 0, 1703953, 24, 0, 1703954, 24, 0, 1703955, 24, 0, 1703956, 24, 0, 1703957, 24, 0, 1703958, 24, 0, 1703959, 24, 0, 1703960, 24, 0, 1703961, 24, 0, 1703962, 23, 0, 1703963, 24, 0, 1703964, 24, 0, 1703965, 24, 0, 1703966, 24, 0, 1703967, 24, 0, 1703968, 23, 0, 1703969, 24, 0, 1703970, 24, 0, 1703971, 24, 0, 1703972, 24, 0, 1703973, 24, 0, 1703974, 24, 0, 1703975, 76, 0, 1703976, 79, 0, 1703977, 24, 0, 1703978, 24, 0, 1703979, 24, 0, 1703980, 24, 0, 1703981, 24, 0, 1703982, 24, 0, 1703983, 24, 0, 1703984, 24, 0, 1703985, 24, 0, 1703986, 24, 0, 1703987, 24, 0, 1703988, 24, 0, 1703989, 24, 0, 1703990, 24, 0, 1703991, 24, 0, 1703992, 24, 0, 1703993, 24, 0, 1703994, 24, 0, 1703995, 24, 0, 1703996, 24, 0, 1703997, 24, 0, 1703998, 24, 0, 1703999, 24, 0, 1704000, 24, 0, 1704001, 24, 0, 1704002, 24, 0, 1704003, 24, 0, 1704004, 24, 0, 1704005, 24, 0, 1704006, 24, 0, 1704007, 24, 0, 1704008, 24, 0, 1704009, 24, 0, 1704010, 24, 0, 1704011, 24, 0, 1704012, 23, 0, 1704013, 24, 0, 1704014, 24, 0, 1704015, 24, 0, 1769478, 24, 0, 1769479, 24, 0, 1769480, 24, 0, 1769481, 24, 0, 1769482, 24, 0, 1769483, 24, 0, 1769484, 24, 0, 1769485, 24, 0, 1769486, 24, 0, 1769487, 24, 0, 1769488, 24, 0, 1769489, 24, 0, 1769490, 24, 0, 1769491, 24, 0, 1769492, 24, 0, 1769493, 24, 0, 1769494, 24, 0, 1769495, 24, 0, 1769496, 24, 0, 1769497, 24, 0, 1769498, 24, 0, 1769499, 24, 0, 1769500, 24, 0, 1769501, 24, 0, 1769502, 24, 0, 1769503, 24, 0, 1769504, 24, 0, 1769505, 24, 0, 1769506, 24, 0, 1769507, 24, 0, 1769508, 24, 0, 1769509, 24, 0, 1769510, 24, 0, 1769511, 76, 0, 1769512, 79, 0, 1769513, 24, 0, 1769514, 24, 0, 1769515, 24, 0, 1769516, 24, 0, 1769517, 24, 0, 1769518, 24, 0, 1769519, 24, 0, 1769520, 24, 0, 1769521, 24, 0, 1769522, 24, 0, 1769523, 24, 0, 1769524, 24, 0, 1769525, 24, 0, 1769526, 24, 0, 1769527, 24, 0, 1769528, 24, 0, 1769529, 24, 0, 1769530, 74, 0, 1769531, 75, 0, 1769532, 75, 0, 1769533, 75, 0, 1769534, 75, 0, 1769535, 75, 0, 1769536, 75, 0, 1769537, 75, 0, 1769538, 75, 0, 1769539, 75, 0, 1769540, 78, 0, 1769541, 24, 0, 1769542, 24, 0, 1769543, 24, 0, 1769544, 24, 0, 1769545, 24, 0, 1769546, 24, 0, 1769547, 24, 0, 1769548, 23, 0, 1769549, 24, 0, 1769550, 24, 0, 1769551, 24, 0, 1835011, 24, 0, 1835012, 24, 0, 1835013, 24, 0, 1835014, 24, 0, 1835015, 23, 0, 1835016, 24, 0, 1835017, 24, 0, 1835018, 24, 0, 1835019, 24, 0, 1835020, 24, 0, 1835021, 24, 0, 1835022, 24, 0, 1835023, 24, 0, 1835024, 24, 0, 1835025, 24, 0, 1835026, 24, 0, 1835027, 24, 0, 1835028, 24, 0, 1835029, 24, 0, 1835030, 24, 0, 1835031, 24, 0, 1835032, 24, 0, 1835033, 24, 0, 1835034, 24, 0, 1835035, 24, 0, 1835036, 24, 0, 1835037, 24, 0, 1835038, 24, 0, 1835039, 24, 0, 1835040, 24, 0, 1835041, 24, 0, 1835042, 24, 0, 1835043, 24, 0, 1835044, 24, 0, 1835045, 24, 0, 1835046, 24, 0, 1835047, 76, 0, 1835048, 79, 0, 1835049, 24, 0, 1835050, 24, 0, 1835051, 24, 0, 1835052, 24, 0, 1835053, 24, 0, 1835054, 24, 0, 1835055, 24, 0, 1835056, 24, 0, 1835057, 24, 0, 1835058, 24, 0, 1835059, 24, 0, 1835060, 24, 0, 1835061, 24, 0, 1835062, 24, 0, 1835063, 74, 0, 1835064, 75, 0, 1835065, 75, 0, 1835066, 77, 0, 1835067, 77, 0, 1835068, 77, 0, 1835069, 81, 0, 1835070, 81, 0, 1835071, 81, 0, 1835072, 81, 0, 1835073, 81, 0, 1835074, 81, 0, 1835075, 81, 0, 1835076, 82, 0, 1835077, 24, 0, 1835078, 23, 0, 1835079, 24, 0, 1835080, 24, 0, 1835081, 24, 0, 1835082, 24, 0, 1835083, 24, 0, 1835084, 24, 0, 1835085, 24, 0, 1835086, 24, 0, 1835087, 24, 0, 1900546, 24, 0, 1900547, 24, 0, 1900548, 24, 0, 1900549, 24, 0, 1900550, 24, 0, 1900551, 24, 0, 1900552, 24, 0, 1900553, 24, 0, 1900554, 24, 0, 1900555, 23, 0, 1900556, 24, 0, 1900557, 24, 0, 1900558, 24, 0, 1900559, 24, 0, 1900560, 24, 0, 1900561, 24, 0, 1900562, 24, 0, 1900563, 24, 0, 1900564, 24, 0, 1900565, 24, 0, 1900566, 24, 0, 1900567, 24, 0, 1900568, 24, 0, 1900569, 24, 0, 1900570, 24, 0, 1900571, 24, 0, 1900572, 24, 0, 1900573, 24, 0, 1900574, 24, 0, 1900575, 24, 0, 1900576, 24, 0, 1900577, 24, 0, 1900578, 24, 0, 1900579, 24, 0, 1900580, 24, 0, 1900581, 24, 0, 1900582, 24, 0, 1900583, 76, 0, 1900584, 77, 0, 1900585, 78, 0, 1900586, 24, 0, 1900587, 24, 0, 1900588, 24, 0, 1900589, 24, 0, 1900590, 23, 0, 1900591, 24, 0, 1900592, 74, 0, 1900593, 75, 0, 1900594, 75, 0, 1900595, 75, 0, 1900596, 75, 0, 1900597, 75, 0, 1900598, 75, 0, 1900599, 77, 0, 1900600, 77, 0, 1900601, 77, 0, 1900602, 81, 0, 1900603, 81, 0, 1900604, 82, 0, 1900605, 23, 0, 1900606, 23, 0, 1900607, 24, 0, 1900608, 24, 0, 1900609, 24, 0, 1900610, 24, 0, 1900611, 24, 0, 1900612, 24, 0, 1900613, 23, 0, 1900614, 24, 0, 1900615, 24, 0, 1900616, 24, 0, 1900617, 24, 0, 1900618, 24, 0, 1900619, 24, 0, 1900620, 24, 0, 1900621, 24, 0, 1900622, 24, 0, 1900623, 24, 0, 1966082, 24, 0, 1966083, 24, 0, 1966084, 24, 0, 1966085, 24, 0, 1966086, 24, 0, 1966087, 24, 0, 1966088, 24, 0, 1966089, 24, 0, 1966090, 24, 0, 1966091, 24, 0, 1966092, 24, 0, 1966093, 24, 0, 1966094, 24, 0, 1966095, 24, 0, 1966096, 24, 0, 1966097, 24, 0, 1966098, 24, 0, 1966099, 24, 0, 1966100, 24, 0, 1966101, 24, 0, 1966102, 24, 0, 1966103, 24, 0, 1966104, 24, 0, 1966105, 24, 0, 1966106, 24, 0, 1966107, 24, 0, 1966108, 24, 0, 1966109, 24, 0, 1966110, 24, 0, 1966111, 24, 0, 1966112, 24, 0, 1966113, 24, 0, 1966114, 24, 0, 1966115, 24, 0, 1966116, 24, 0, 1966117, 24, 0, 1966118, 24, 0, 1966119, 76, 0, 1966120, 77, 0, 1966121, 77, 0, 1966122, 75, 0, 1966123, 75, 0, 1966124, 75, 0, 1966125, 75, 0, 1966126, 75, 0, 1966127, 75, 0, 1966128, 77, 0, 1966129, 77, 0, 1966130, 77, 0, 1966131, 81, 0, 1966132, 81, 0, 1966133, 81, 0, 1966134, 81, 0, 1966135, 81, 0, 1966136, 81, 0, 1966137, 82, 0, 1966138, 24, 0, 1966139, 24, 0, 1966140, 24, 0, 1966141, 24, 0, 1966142, 24, 0, 1966143, 24, 0, 1966144, 24, 0, 1966145, 24, 0, 1966146, 24, 0, 1966147, 24, 0, 1966148, 23, 0, 1966149, 23, 0, 1966150, 24, 0, 1966151, 24, 0, 1966152, 24, 0, 1966153, 23, 0, 1966154, 24, 0, 1966155, 24, 0, 1966156, 24, 0, 1966157, 24, 0, 1966158, 24, 0, 1966159, 24, 0, 2031617, 24, 0, 2031618, 24, 0, 2031619, 24, 0, 2031620, 24, 0, 2031621, 24, 0, 2031622, 24, 0, 2031623, 24, 0, 2031624, 24, 0, 2031625, 24, 0, 2031626, 24, 0, 2031627, 24, 0, 2031628, 24, 0, 2031629, 24, 0, 2031630, 24, 0, 2031631, 24, 0, 2031632, 24, 0, 2031633, 24, 0, 2031634, 23, 0, 2031635, 24, 0, 2031636, 24, 0, 2031637, 24, 0, 2031638, 24, 0, 2031639, 24, 0, 2031640, 24, 0, 2031641, 24, 0, 2031642, 24, 0, 2031643, 24, 0, 2031644, 24, 0, 2031645, 24, 0, 2031646, 23, 0, 2031647, 24, 0, 2031648, 24, 0, 2031649, 24, 0, 2031650, 24, 0, 2031651, 24, 0, 2031652, 24, 0, 2031653, 23, 0, 2031654, 24, 0, 2031655, 76, 0, 2031656, 77, 0, 2031657, 81, 0, 2031658, 81, 0, 2031659, 81, 0, 2031660, 81, 0, 2031661, 81, 0, 2031662, 81, 0, 2031663, 81, 0, 2031664, 81, 0, 2031665, 81, 0, 2031666, 82, 0, 2031667, 24, 0, 2031668, 24, 0, 2031669, 24, 0, 2031670, 24, 0, 2031671, 24, 0, 2031672, 24, 0, 2031673, 24, 0, 2031674, 24, 0, 2031675, 24, 0, 2031676, 24, 0, 2031677, 24, 0, 2031678, 24, 0, 2031679, 24, 0, 2031680, 24, 0, 2031681, 24, 0, 2031682, 24, 0, 2031683, 24, 0, 2031684, 24, 0, 2031685, 24, 0, 2031686, 24, 0, 2031687, 24, 0, 2031688, 24, 0, 2031689, 24, 0, 2031690, 24, 0, 2031691, 24, 0, 2031692, 24, 0, 2031693, 24, 0, 2031694, 24, 0, 2031695, 24, 0, 2097153, 24, 0, 2097154, 24, 0, 2097155, 24, 0, 2097156, 24, 0, 2097157, 24, 0, 2097158, 24, 0, 2097159, 24, 0, 2097160, 24, 0, 2097161, 24, 0, 2097162, 24, 0, 2097163, 24, 0, 2097164, 24, 0, 2097165, 24, 0, 2097166, 24, 0, 2097167, 24, 0, 2097168, 24, 0, 2097169, 24, 0, 2097170, 24, 0, 2097171, 24, 0, 2097172, 24, 0, 2097173, 24, 0, 2097174, 24, 0, 2097175, 24, 0, 2097176, 24, 0, 2097177, 24, 0, 2097178, 24, 0, 2097179, 23, 0, 2097180, 24, 0, 2097181, 24, 0, 2097182, 24, 0, 2097183, 24, 0, 2097184, 24, 0, 2097185, 24, 0, 2097186, 24, 0, 2097187, 24, 0, 2097188, 24, 0, 2097189, 24, 0, 2097190, 24, 0, 2097191, 76, 0, 2097192, 79, 0, 2097193, 24, 0, 2097194, 24, 0, 2097195, 24, 0, 2097196, 24, 0, 2097197, 24, 0, 2097198, 24, 0, 2097199, 24, 0, 2097200, 24, 0, 2097201, 24, 0, 2097202, 24, 0, 2097203, 24, 0, 2097204, 24, 0, 2097205, 24, 0, 2097206, 24, 0, 2097207, 24, 0, 2097208, 24, 0, 2097209, 24, 0, 2097210, 24, 0, 2097211, 24, 0, 2097212, 24, 0, 2097213, 24, 0, 2097214, 24, 0, 2097215, 24, 0, 2097216, 24, 0, 2097217, 24, 0, 2097218, 24, 0, 2097219, 24, 0, 2097220, 24, 0, 2097221, 24, 0, 2097222, 24, 0, 2097223, 24, 0, 2097224, 24, 0, 2097225, 24, 0, 2097226, 24, 0, 2097227, 24, 0, 2097228, 24, 0, 2097229, 24, 0, 2097230, 24, 0, 2097231, 24, 0, 2162689, 24, 0, 2162690, 24, 0, 2162691, 24, 0, 2162692, 24, 0, 2162693, 24, 0, 2162694, 74, 0, 2162695, 77, 0, 2162696, 75, 0, 2162697, 75, 0, 2162698, 75, 0, 2162699, 75, 0, 2162700, 75, 0, 2162701, 75, 0, 2162702, 75, 0, 2162703, 78, 0, 2162704, 24, 0, 2162705, 24, 0, 2162706, 24, 0, 2162707, 24, 0, 2162708, 24, 0, 2162709, 24, 0, 2162710, 24, 0, 2162711, 24, 0, 2162712, 24, 0, 2162713, 24, 0, 2162714, 24, 0, 2162715, 24, 0, 2162716, 24, 0, 2162717, 24, 0, 2162718, 24, 0, 2162719, 24, 0, 2162720, 24, 0, 2162721, 24, 0, 2162722, 24, 0, 2162723, 24, 0, 2162724, 24, 0, 2162725, 24, 0, 2162726, 24, 0, 2162727, 76, 0, 2162728, 79, 0, 2162729, 24, 0, 2162730, 24, 0, 2162731, 24, 0, 2162732, 24, 0, 2162733, 24, 0, 2162734, 24, 0, 2162735, 24, 0, 2162736, 24, 0, 2162737, 24, 0, 2162738, 24, 0, 2162739, 24, 0, 2162740, 24, 0, 2162741, 24, 0, 2162742, 24, 0, 2162743, 24, 0, 2162744, 24, 0, 2162745, 24, 0, 2162746, 24, 0, 2162747, 24, 0, 2162748, 24, 0, 2162749, 24, 0, 2162750, 24, 0, 2162751, 24, 0, 2162752, 24, 0, 2162753, 24, 0, 2162754, 24, 0, 2162755, 24, 0, 2162756, 24, 0, 2162757, 24, 0, 2162758, 23, 0, 2162759, 24, 0, 2162760, 24, 0, 2162761, 24, 0, 2162762, 24, 0, 2162763, 24, 0, 2162764, 24, 0, 2162765, 24, 0, 2162766, 24, 0, 2228225, 24, 0, 2228226, 24, 0, 2228227, 24, 0, 2228228, 24, 0, 2228229, 24, 0, 2228230, 80, 0, 2228231, 81, 0, 2228232, 81, 0, 2228233, 77, 0, 2228234, 77, 0, 2228235, 77, 0, 2228236, 77, 0, 2228237, 81, 0, 2228238, 77, 0, 2228239, 77, 0, 2228240, 78, 0, 2228241, 24, 0, 2228242, 24, 0, 2228243, 24, 0, 2228244, 24, 0, 2228245, 24, 0, 2228246, 24, 0, 2228247, 24, 0, 2228248, 24, 0, 2228249, 24, 0, 2228250, 24, 0, 2228251, 24, 0, 2228252, 24, 0, 2228253, 24, 0, 2228254, 24, 0, 2228255, 24, 0, 2228256, 24, 0, 2228257, 24, 0, 2228258, 24, 0, 2228259, 24, 0, 2228260, 24, 0, 2228261, 24, 0, 2228262, 24, 0, 2228263, 76, 0, 2228264, 79, 0, 2228265, 24, 0, 2228266, 24, 0, 2228267, 24, 0, 2228268, 24, 0, 2228269, 24, 0, 2228270, 24, 0, 2228271, 24, 0, 2228272, 24, 0, 2228273, 24, 0, 2228274, 24, 0, 2228275, 24, 0, 2228276, 24, 0, 2228277, 24, 0, 2228278, 24, 0, 2228279, 24, 0, 2228280, 24, 0, 2228281, 24, 0, 2228282, 24, 0, 2228283, 24, 0, 2228284, 24, 0, 2228285, 24, 0, 2228286, 24, 0, 2228287, 24, 0, 2228288, 24, 0, 2228289, 24, 0, 2228290, 24, 0, 2228291, 24, 0, 2228292, 24, 0, 2228293, 24, 0, 2228294, 23, 0, 2228295, 23, 0, 2228296, 24, 0, 2228297, 24, 0, 2228298, 24, 0, 2228299, 24, 0, 2228300, 24, 0, 2228301, 24, 0, 2228302, 24, 0, 2293760, 24, 0, 2293761, 24, 0, 2293762, 24, 0, 2293763, 24, 0, 2293764, 24, 0, 2293765, 23, 0, 2293766, 24, 0, 2293767, 24, 0, 2293768, 24, 0, 2293769, 76, 0, 2293770, 77, 0, 2293771, 77, 0, 2293772, 82, 0, 2293773, 24, 0, 2293774, 80, 0, 2293775, 77, 0, 2293776, 77, 0, 2293777, 78, 0, 2293778, 24, 0, 2293779, 24, 0, 2293780, 24, 0, 2293781, 24, 0, 2293782, 24, 0, 2293783, 24, 0, 2293784, 24, 0, 2293785, 24, 0, 2293786, 24, 0, 2293787, 24, 0, 2293788, 24, 0, 2293789, 24, 0, 2293790, 24, 0, 2293791, 24, 0, 2293792, 24, 0, 2293793, 24, 0, 2293794, 24, 0, 2293795, 24, 0, 2293796, 24, 0, 2293797, 24, 0, 2293798, 24, 0, 2293799, 76, 0, 2293800, 79, 0, 2293801, 24, 0, 2293802, 24, 0, 2293803, 24, 0, 2293804, 24, 0, 2293805, 24, 0, 2293806, 24, 0, 2293807, 24, 0, 2293808, 24, 0, 2293809, 24, 0, 2293810, 24, 0, 2293811, 24, 0, 2293812, 24, 0, 2293813, 24, 0, 2293814, 24, 0, 2293815, 24, 0, 2293816, 24, 0, 2293817, 24, 0, 2293818, 24, 0, 2293819, 24, 0, 2293820, 23, 0, 2293821, 24, 0, 2293822, 24, 0, 2293823, 24, 0, 2293824, 24, 0, 2293825, 24, 0, 2293826, 24, 0, 2293827, 24, 0, 2293828, 24, 0, 2293829, 24, 0, 2293830, 24, 0, 2293831, 24, 0, 2293832, 24, 0, 2293833, 24, 0, 2293834, 24, 0, 2293835, 24, 0, 2293836, 24, 0, 2293837, 24, 0, 2293838, 24, 0, 2359296, 24, 0, 2359297, 24, 0, 2359298, 24, 0, 2359299, 24, 0, 2359300, 24, 0, 2359301, 24, 0, 2359302, 24, 0, 2359303, 24, 0, 2359304, 24, 0, 2359305, 80, 0, 2359306, 81, 0, 2359307, 82, 0, 2359308, 24, 0, 2359309, 24, 0, 2359310, 24, 0, 2359311, 80, 0, 2359312, 77, 0, 2359313, 77, 0, 2359314, 78, 0, 2359315, 24, 0, 2359316, 24, 0, 2359317, 24, 0, 2359318, 23, 0, 2359319, 24, 0, 2359320, 24, 0, 2359321, 24, 0, 2359322, 24, 0, 2359323, 24, 0, 2359324, 24, 0, 2359325, 24, 0, 2359326, 24, 0, 2359327, 24, 0, 2359328, 24, 0, 2359329, 24, 0, 2359330, 24, 0, 2359331, 24, 0, 2359332, 24, 0, 2359333, 24, 0, 2359334, 24, 0, 2359335, 76, 0, 2359336, 79, 0, 2359337, 24, 0, 2359338, 24, 0, 2359339, 24, 0, 2359340, 24, 0, 2359341, 24, 0, 2359342, 24, 0, 2359343, 24, 0, 2359344, 24, 0, 2359345, 24, 0, 2359346, 24, 0, 2359347, 24, 0, 2359348, 24, 0, 2359349, 24, 0, 2359350, 24, 0, 2359351, 24, 0, 2359352, 24, 0, 2359353, 24, 0, 2359354, 24, 0, 2359355, 24, 0, 2359356, 23, 0, 2359357, 24, 0, 2359358, 24, 0, 2359359, 24, 0, 2359360, 24, 0, 2359361, 24, 0, 2359362, 24, 0, 2359363, 24, 0, 2359364, 24, 0, 2359365, 24, 0, 2359366, 24, 0, 2359367, 24, 0, 2359368, 24, 0, 2359369, 24, 0, 2359370, 24, 0, 2359371, 23, 0, 2359372, 23, 0, 2359373, 23, 0, 2424833, 24, 0, 2424834, 24, 0, 2424835, 24, 0, 2424836, 24, 0, 2424837, 24, 0, 2424838, 24, 0, 2424839, 24, 0, 2424840, 24, 0, 2424841, 24, 0, 2424842, 24, 0, 2424843, 24, 0, 2424844, 23, 0, 2424845, 23, 0, 2424846, 24, 0, 2424847, 24, 0, 2424848, 80, 0, 2424849, 77, 0, 2424850, 77, 0, 2424851, 78, 0, 2424852, 24, 0, 2424853, 24, 0, 2424854, 24, 0, 2424855, 24, 0, 2424856, 24, 0, 2424857, 24, 0, 2424858, 24, 0, 2424859, 24, 0, 2424860, 24, 0, 2424861, 24, 0, 2424862, 24, 0, 2424863, 24, 0, 2424864, 24, 0, 2424865, 24, 0, 2424866, 24, 0, 2424867, 24, 0, 2424868, 24, 0, 2424869, 24, 0, 2424870, 24, 0, 2424871, 76, 0, 2424872, 79, 0, 2424873, 24, 0, 2424874, 24, 0, 2424875, 24, 0, 2424876, 24, 0, 2424877, 24, 0, 2424878, 24, 0, 2424879, 24, 0, 2424880, 24, 0, 2424881, 24, 0, 2424882, 24, 0, 2424883, 24, 0, 2424884, 24, 0, 2424885, 24, 0, 2424886, 24, 0, 2424887, 24, 0, 2424888, 24, 0, 2424889, 24, 0, 2424890, 24, 0, 2424891, 24, 0, 2424892, 24, 0, 2424893, 24, 0, 2424894, 24, 0, 2424895, 24, 0, 2424896, 24, 0, 2424897, 24, 0, 2424898, 24, 0, 2424899, 24, 0, 2424900, 24, 0, 2424901, 24, 0, 2424902, 24, 0, 2424903, 24, 0, 2424904, 24, 0, 2424905, 24, 0, 2424906, 24, 0, 2424907, 24, 0, 2424908, 24, 0, 2424909, 24, 0, 2490370, 24, 0, 2490371, 24, 0, 2490372, 24, 0, 2490373, 24, 0, 2490374, 24, 0, 2490375, 24, 0, 2490376, 24, 0, 2490377, 24, 0, 2490378, 24, 0, 2490379, 24, 0, 2490380, 24, 0, 2490381, 24, 0, 2490382, 24, 0, 2490383, 24, 0, 2490384, 24, 0, 2490385, 80, 0, 2490386, 77, 0, 2490387, 77, 0, 2490388, 78, 0, 2490389, 24, 0, 2490390, 24, 0, 2490391, 24, 0, 2490392, 24, 0, 2490393, 24, 0, 2490394, 24, 0, 2490395, 24, 0, 2490396, 24, 0, 2490397, 24, 0, 2490398, 24, 0, 2490399, 24, 0, 2490400, 24, 0, 2490401, 24, 0, 2490402, 24, 0, 2490403, 24, 0, 2490404, 24, 0, 2490405, 24, 0, 2490406, 24, 0, 2490407, 76, 0, 2490408, 79, 0, 2490409, 24, 0, 2490410, 24, 0, 2490411, 24, 0, 2490412, 24, 0, 2490413, 24, 0, 2490414, 24, 0, 2490415, 24, 0, 2490416, 24, 0, 2490417, 24, 0, 2490418, 24, 0, 2490419, 24, 0, 2490420, 24, 0, 2490421, 24, 0, 2490422, 24, 0, 2490423, 24, 0, 2490424, 24, 0, 2490425, 24, 0, 2490426, 24, 0, 2490427, 24, 0, 2490428, 24, 0, 2490429, 24, 0, 2490430, 24, 0, 2490431, 24, 0, 2490432, 24, 0, 2490433, 24, 0, 2490434, 24, 0, 2490435, 24, 0, 2490436, 24, 0, 2490437, 24, 0, 2490438, 24, 0, 2490439, 24, 0, 2490440, 24, 0, 2490441, 24, 0, 2490442, 24, 0, 2490443, 24, 0, 2490444, 24, 0, 2490445, 24, 0, 2555906, 24, 0, 2555907, 24, 0, 2555908, 24, 0, 2555909, 24, 0, 2555910, 24, 0, 2555911, 24, 0, 2555912, 24, 0, 2555913, 24, 0, 2555914, 24, 0, 2555915, 24, 0, 2555916, 24, 0, 2555917, 24, 0, 2555918, 24, 0, 2555919, 24, 0, 2555920, 24, 0, 2555921, 24, 0, 2555922, 80, 0, 2555923, 77, 0, 2555924, 77, 0, 2555925, 78, 0, 2555926, 24, 0, 2555927, 24, 0, 2555928, 24, 0, 2555929, 24, 0, 2555930, 24, 0, 2555931, 24, 0, 2555932, 24, 0, 2555933, 24, 0, 2555934, 24, 0, 2555935, 24, 0, 2555936, 24, 0, 2555937, 24, 0, 2555938, 24, 0, 2555939, 24, 0, 2555940, 24, 0, 2555941, 24, 0, 2555942, 74, 0, 2555943, 77, 0, 2555944, 79, 0, 2555945, 24, 0, 2555946, 24, 0, 2555947, 24, 0, 2555948, 24, 0, 2555949, 24, 0, 2555950, 24, 0, 2555951, 24, 0, 2555952, 24, 0, 2555953, 24, 0, 2555954, 24, 0, 2555955, 24, 0, 2555956, 24, 0, 2555957, 24, 0, 2555958, 24, 0, 2555959, 24, 0, 2555960, 24, 0, 2555961, 24, 0, 2555962, 24, 0, 2555963, 24, 0, 2555964, 24, 0, 2555965, 24, 0, 2555966, 24, 0, 2555967, 24, 0, 2555968, 24, 0, 2555969, 24, 0, 2555970, 24, 0, 2555971, 24, 0, 2555972, 24, 0, 2555973, 24, 0, 2555974, 24, 0, 2555975, 24, 0, 2555976, 24, 0, 2555977, 24, 0, 2555978, 24, 0, 2555979, 24, 0, 2555980, 24, 0, 2555981, 24, 0, 2621443, 24, 0, 2621444, 24, 0, 2621445, 24, 0, 2621446, 24, 0, 2621447, 24, 0, 2621448, 24, 0, 2621449, 24, 0, 2621450, 24, 0, 2621451, 24, 0, 2621452, 24, 0, 2621453, 24, 0, 2621454, 24, 0, 2621455, 24, 0, 2621456, 24, 0, 2621457, 24, 0, 2621458, 24, 0, 2621459, 80, 0, 2621460, 77, 0, 2621461, 77, 0, 2621462, 78, 0, 2621463, 24, 0, 2621464, 23, 0, 2621465, 24, 0, 2621466, 24, 0, 2621467, 24, 0, 2621468, 24, 0, 2621469, 24, 0, 2621470, 24, 0, 2621471, 24, 0, 2621472, 24, 0, 2621473, 24, 0, 2621474, 24, 0, 2621475, 24, 0, 2621476, 24, 0, 2621477, 24, 0, 2621478, 76, 0, 2621479, 77, 0, 2621480, 79, 0, 2621481, 24, 0, 2621482, 24, 0, 2621483, 24, 0, 2621484, 24, 0, 2621485, 24, 0, 2621486, 24, 0, 2621487, 24, 0, 2621488, 24, 0, 2621489, 24, 0, 2621490, 24, 0, 2621491, 24, 0, 2621492, 24, 0, 2621493, 23, 0, 2621494, 24, 0, 2621495, 24, 0, 2621496, 24, 0, 2621497, 24, 0, 2621498, 24, 0, 2621499, 24, 0, 2621500, 24, 0, 2621501, 24, 0, 2621502, 24, 0, 2621503, 24, 0, 2621504, 24, 0, 2621505, 24, 0, 2621506, 24, 0, 2621507, 24, 0, 2621508, 24, 0, 2621509, 24, 0, 2621510, 24, 0, 2621511, 24, 0, 2621512, 24, 0, 2621513, 24, 0, 2621514, 24, 0, 2621515, 24, 0, 2621516, 24, 0, 2686979, 24, 0, 2686980, 24, 0, 2686981, 24, 0, 2686982, 23, 0, 2686983, 24, 0, 2686984, 24, 0, 2686985, 24, 0, 2686986, 24, 0, 2686987, 24, 0, 2686988, 24, 0, 2686989, 24, 0, 2686990, 24, 0, 2686991, 24, 0, 2686992, 24, 0, 2686993, 23, 0, 2686994, 24, 0, 2686995, 24, 0, 2686996, 80, 0, 2686997, 77, 0, 2686998, 77, 0, 2686999, 78, 0, 2687000, 24, 0, 2687001, 23, 0, 2687002, 24, 0, 2687003, 24, 0, 2687004, 24, 0, 2687005, 24, 0, 2687006, 24, 0, 2687007, 24, 0, 2687008, 24, 0, 2687009, 24, 0, 2687010, 23, 0, 2687011, 24, 0, 2687012, 24, 0, 2687013, 74, 0, 2687014, 77, 0, 2687015, 77, 0, 2687016, 82, 0, 2687017, 24, 0, 2687018, 24, 0, 2687019, 24, 0, 2687020, 24, 0, 2687021, 24, 0, 2687022, 24, 0, 2687023, 24, 0, 2687024, 24, 0, 2687025, 24, 0, 2687026, 24, 0, 2687027, 24, 0, 2687028, 24, 0, 2687029, 23, 0, 2687030, 23, 0, 2687031, 24, 0, 2687032, 24, 0, 2687033, 24, 0, 2687034, 24, 0, 2687035, 24, 0, 2687036, 24, 0, 2687037, 24, 0, 2687038, 24, 0, 2687039, 24, 0, 2687040, 24, 0, 2687041, 24, 0, 2687042, 24, 0, 2687043, 24, 0, 2687044, 24, 0, 2687045, 24, 0, 2687046, 24, 0, 2687047, 23, 0, 2687048, 23, 0, 2687049, 24, 0, 2687050, 24, 0, 2687051, 24, 0, 2687052, 24, 0, 2752515, 24, 0, 2752516, 24, 0, 2752517, 24, 0, 2752518, 24, 0, 2752519, 24, 0, 2752520, 24, 0, 2752521, 24, 0, 2752522, 24, 0, 2752523, 24, 0, 2752524, 24, 0, 2752525, 24, 0, 2752526, 24, 0, 2752527, 24, 0, 2752528, 24, 0, 2752529, 24, 0, 2752530, 24, 0, 2752531, 24, 0, 2752532, 24, 0, 2752533, 80, 0, 2752534, 77, 0, 2752535, 77, 0, 2752536, 78, 0, 2752537, 24, 0, 2752538, 24, 0, 2752539, 24, 0, 2752540, 24, 0, 2752541, 24, 0, 2752542, 24, 0, 2752543, 24, 0, 2752544, 24, 0, 2752545, 24, 0, 2752546, 24, 0, 2752547, 24, 0, 2752548, 74, 0, 2752549, 77, 0, 2752550, 77, 0, 2752551, 82, 0, 2752552, 24, 0, 2752553, 24, 0, 2752554, 24, 0, 2752555, 24, 0, 2752556, 24, 0, 2752557, 24, 0, 2752558, 24, 0, 2752559, 24, 0, 2752560, 24, 0, 2752561, 24, 0, 2752562, 24, 0, 2752563, 24, 0, 2752564, 24, 0, 2752565, 24, 0, 2752566, 24, 0, 2752567, 24, 0, 2752568, 24, 0, 2752569, 24, 0, 2752570, 24, 0, 2752571, 24, 0, 2752572, 24, 0, 2752573, 24, 0, 2752574, 24, 0, 2752575, 23, 0, 2752576, 23, 0, 2752577, 24, 0, 2752578, 24, 0, 2752579, 24, 0, 2752580, 24, 0, 2752581, 24, 0, 2752582, 24, 0, 2752583, 24, 0, 2752584, 24, 0, 2752585, 24, 0, 2752586, 24, 0, 2752587, 24, 0, 2818051, 24, 0, 2818052, 24, 0, 2818053, 24, 0, 2818054, 24, 0, 2818055, 24, 0, 2818056, 24, 0, 2818057, 24, 0, 2818058, 24, 0, 2818059, 24, 0, 2818060, 24, 0, 2818061, 24, 0, 2818062, 24, 0, 2818063, 24, 0, 2818064, 24, 0, 2818065, 24, 0, 2818066, 24, 0, 2818067, 24, 0, 2818068, 24, 0, 2818069, 24, 0, 2818070, 80, 0, 2818071, 77, 0, 2818072, 77, 0, 2818073, 78, 0, 2818074, 24, 0, 2818075, 24, 0, 2818076, 24, 0, 2818077, 24, 0, 2818078, 24, 0, 2818079, 24, 0, 2818080, 74, 0, 2818081, 75, 0, 2818082, 75, 0, 2818083, 75, 0, 2818084, 77, 0, 2818085, 77, 0, 2818086, 82, 0, 2818087, 23, 0, 2818088, 24, 0, 2818089, 24, 0, 2818090, 24, 0, 2818091, 24, 0, 2818092, 24, 0, 2818093, 24, 0, 2818094, 23, 0, 2818095, 24, 0, 2818096, 24, 0, 2818097, 24, 0, 2818100, 24, 0, 2818101, 24, 0, 2818102, 24, 0, 2818103, 24, 0, 2818104, 24, 0, 2818105, 24, 0, 2818106, 24, 0, 2818107, 24, 0, 2818108, 24, 0, 2818109, 24, 0, 2883587, 24, 0, 2883588, 24, 0, 2883589, 24, 0, 2883590, 24, 0, 2883591, 24, 0, 2883592, 23, 0, 2883593, 24, 0, 2883594, 24, 0, 2883595, 24, 0, 2883596, 24, 0, 2883597, 24, 0, 2883598, 24, 0, 2883599, 24, 0, 2883600, 24, 0, 2883601, 24, 0, 2883602, 24, 0, 2883603, 24, 0, 2883604, 24, 0, 2883605, 24, 0, 2883606, 24, 0, 2883607, 80, 0, 2883608, 77, 0, 2883609, 77, 0, 2883610, 75, 0, 2883611, 75, 0, 2883612, 75, 0, 2883613, 75, 0, 2883614, 75, 0, 2883615, 75, 0, 2883616, 77, 0, 2883617, 81, 0, 2883618, 81, 0, 2883619, 81, 0, 2883620, 81, 0, 2883621, 82, 0, 2883622, 24, 0, 2883623, 24, 0, 2883624, 24, 0, 2883625, 24, 0, 2883626, 24, 0, 2883627, 24, 0, 2883628, 24, 0, 2883629, 24, 0, 2949123, 24, 0, 2949124, 24, 0, 2949125, 24, 0, 2949126, 24, 0, 2949127, 24, 0, 2949128, 23, 0, 2949129, 23, 0, 2949130, 24, 0, 2949131, 24, 0, 2949132, 24, 0, 2949133, 24, 0, 2949134, 24, 0, 2949135, 24, 0, 2949136, 24, 0, 2949137, 24, 0, 2949138, 24, 0, 2949139, 24, 0, 2949140, 24, 0, 2949141, 24, 0, 2949142, 24, 0, 2949143, 24, 0, 2949144, 80, 0, 2949145, 81, 0, 2949146, 81, 0, 2949147, 81, 0, 2949148, 81, 0, 2949149, 81, 0, 2949150, 81, 0, 2949151, 81, 0, 2949152, 82, 0, 2949153, 24, 0, 2949154, 24, 0, 2949155, 24, 0, 2949156, 24, 0, 2949157, 24, 0, 2949158, 24, 0, 2949159, 24, 0, 2949160, 24, 0, 2949161, 24, 0, 2949162, 24, 0, 2949163, 24, 0, 2949164, 24, 0, 2949167, 24, 0, 2949168, 24, 0, 2949169, 24, 0, 2949170, 24, 0, 3014659, 24, 0, 3014660, 24, 0, 3014661, 24, 0, 3014662, 24, 0, 3014663, 24, 0, 3014664, 24, 0, 3014665, 24, 0, 3014666, 23, 0, 3014667, 23, 0, 3014668, 24, 0, 3014669, 24, 0, 3014670, 24, 0, 3014671, 24, 0, 3014672, 24, 0, 3014680, 24, 0, 3014681, 24, 0, 3014682, 24, 0, 3014683, 24, 0, 3014684, 24, 0, 3014685, 24, 0, 3014686, 24, 0, 3014687, 24, 0, 3014688, 24, 0, 3014689, 24, 0, 3014690, 24, 0, 3014691, 24, 0, 3014692, 24, 0, 3014693, 24, 0, 3080196, 24, 0, 3080197, 24, 0, 3080198, 24, 0, 3080199, 24, 0, 3080200, 24, 0, 3080201, 24, 0, 3080202, 24, 0, 3080203, 23, 0, 3080204, 24, 0, 3080205, 24, 0, 3080206, 24, 0, 3080207, 24, 0, 3080218, 24, 0, 3080219, 24, 0, 3080220, 24, 0, 3080221, 24, 0, 3080222, 24, 0, 3080223, 24, 0, 3080224, 24, 0, 3080225, 24, 0, 3080226, 24, 0, 3145733, 24, 0, 3145734, 24, 0, 3145735, 24, 0, 3145736, 24, 0, 3145737, 24, 0, 3145738, 24, 0, 3145739, 24, 0, 3145740, 24, 0, 3145741, 24, 0, 3145755, 24, 0, 3145756, 24, 0, 3145757, 24, 0, 3145758, 24, 0, 3145759, 24, 0, 3145760, 24, 0, 3145761, 24, 0 )

[node name="Walls" type="TileMap" parent="Nav"]
z_index = 1
tile_set = ExtResource( 5 )
cell_size = Vector2( 16, 16 )
cell_tile_origin = 2
cell_y_sort = true
show_collision = true
bake_navigation = true
format = 1
tile_data = PoolIntArray( 131071, 38, 0, 65559, 29, 0, 65560, 29, 0, 65564, 29, 0, 65565, 29, 0, 65566, 29, 0, 65567, 29, 0, 65569, 87, 0, 65570, 87, 0, 65571, 87, 0, 65572, 87, 0, 65573, 87, 0, 65574, 87, 0, 65575, 87, 0, 65576, 87, 0, 65577, 87, 0, 65578, 87, 0, 65579, 87, 0, 65580, 87, 0, 65584, 34, 0, 196607, 38, 0, 131094, 87, 0, 131095, 87, 0, 131096, 87, 0, 131097, 87, 0, 131098, 87, 0, 131099, 87, 0, 131100, 87, 0, 131101, 87, 0, 131102, 87, 0, 131103, 87, 0, 131104, 88, 0, 131117, 83, 0, 262143, 38, 0, 196624, 87, 0, 196625, 87, 0, 196626, 87, 0, 196627, 87, 0, 196628, 87, 0, 196629, 87, 0, 196630, 87, 0, 196653, 86, 0, 196654, 87, 0, 196655, 87, 0, 196656, 87, 0, 196657, 87, 0, 196658, 87, 0, 327679, 38, 0, 262155, 87, 0, 262156, 87, 0, 262157, 87, 0, 262158, 87, 0, 262159, 88, 0, 262195, 86, 0, 262196, 87, 0, 262197, 87, 0, 262198, 87, 0, 262199, 87, 0, 393215, 38, 0, 327690, 85, 0, 327736, 83, 0, 458751, 38, 0, 393226, 85, 0, 393272, 86, 0, 524287, 38, 0, 458761, 87, 0, 458762, 88, 0, 458809, 86, 0, 458810, 87, 0, 458811, 87, 0, 458812, 87, 0, 458813, 87, 0, 458814, 87, 0, 524296, 85, 0, 524351, 83, 0, 589832, 85, 0, 589887, 83, 0, 655368, 85, 0, 655423, 83, 0, 720904, 85, 0, 720959, 86, 0, 720961, 16, 0, 720962, 16, 0, 786440, 85, 0, 786496, 86, 0, 786497, 87, 0, 786498, 87, 0, 786499, 87, 0, 851974, 92, 0, 851975, 92, 0, 851976, 88, 0, 852036, 83, 0, 917509, 85, 0, 917572, 86, 0, 983045, 85, 0, 983109, 83, 0, 1048581, 85, 0, 1048645, 83, 0, 1114118, 82, 0, 1114119, 31, 0, 1114120, 31, 0, 1114181, 86, 0, 1114182, 87, 0, 1114183, 87, 0, 1114184, 87, 0, 1114185, 87, 0, 1179655, 81, 0, 1179656, 81, 0, 1179657, 81, 0, 1179658, 81, 0, 1179659, 81, 0, 1179660, 81, 0, 1179661, 81, 0, 1179662, 81, 0, 1179663, 82, 0, 1179722, 83, 0, 1245199, 85, 0, 1245258, 83, 0, 1310735, 85, 0, 1310794, 86, 0, 1310795, 87, 0, 1376269, 87, 0, 1376270, 87, 0, 1376271, 88, 0, 1376332, 83, 0, 1441804, 88, 0, 1441868, 83, 0, 1507339, 85, 0, 1507404, 86, 0, 1507405, 87, 0, 1572875, 85, 0, 1572942, 86, 0, 1638411, 85, 0, 1638479, 83, 0, 1703947, 85, 0, 1704015, 83, 0, 1769482, 92, 0, 1769483, 88, 0, 1769551, 83, 0, 1835016, 92, 0, 1835017, 88, 0, 1835087, 83, 0, 1900547, 92, 0, 1900548, 92, 0, 1900549, 92, 0, 1900550, 92, 0, 1900551, 88, 0, 1900623, 83, 0, 1966082, 88, 0, 1966159, 83, 0, 2031617, 85, 0, 2031695, 83, 0, 2097153, 85, 0, 2097231, 83, 0, 2162689, 85, 0, 2162766, 15, 0, 2162767, 83, 0, 2228225, 85, 0, 2228302, 80, 0, 2293761, 88, 0, 2293838, 83, 0, 2359296, 85, 0, 2424832, 85, 0, 2490369, 81, 0, 2490370, 82, 0, 2490445, 80, 0, 2555906, 85, 0, 2555981, 83, 0, 2621442, 85, 0, 2621448, 27, 0, 2621449, 25, 0, 2621516, 80, 0, 2686978, 85, 0, 2687052, 83, 0, 2752514, 85, 0, 2752587, 80, 0, 2818050, 85, 0, 2818115, 80, 0, 2818116, 81, 0, 2818117, 81, 0, 2818118, 81, 0, 2818119, 81, 0, 2818120, 81, 0, 2818121, 81, 0, 2818122, 81, 0, 2883586, 85, 0, 2883633, 31, 0, 2883635, 29, 0, 2883638, 80, 0, 2883639, 81, 0, 2883640, 81, 0, 2883641, 81, 0, 2883642, 81, 0, 2883643, 81, 0, 2883644, 81, 0, 2883645, 81, 0, 2883646, 81, 0, 2883647, 81, 0, 2883648, 81, 0, 2883649, 81, 0, 2883650, 81, 0, 2949122, 85, 0, 2949155, 34, 0, 2949168, 80, 0, 2949169, 81, 0, 2949170, 81, 0, 2949171, 81, 0, 2949172, 81, 0, 2949173, 81, 0, 3014658, 85, 0, 3014686, 20, 0, 3014687, 21, 0, 3014688, 20, 0, 3014700, 80, 0, 3014701, 81, 0, 3014702, 81, 0, 3014703, 81, 0, 3080195, 82, 0, 3080227, 80, 0, 3080228, 81, 0, 3080229, 81, 0, 3080230, 81, 0, 3080231, 81, 0, 3080232, 81, 0, 3080233, 81, 0, 3080234, 81, 0, 3080235, 81, 0, 3145732, 81, 0, 3145733, 81, 0, 3145734, 81, 0, 3145735, 81, 0, 3145736, 81, 0 )

[node name="Player" parent="Nav/Walls" instance=ExtResource( 4 )]
position = Vector2( 638, 71 )
hp_regen = 1

[node name="NPC" parent="Nav/Walls" instance=ExtResource( 8 )]
position = Vector2( 1102, 505 )

[node name="NPC2" parent="Nav/Walls" instance=ExtResource( 8 )]
position = Vector2( 1166, 436 )

[node name="Node2D" parent="Nav/Walls" instance=ExtResource( 7 )]
position = Vector2( 92, 533 )
target = "res://src/Map/MapScenes/JamCave.tscn"

[node name="Areas" type="Node2D" parent="Nav/Walls"]
position = Vector2( -49, -6 )

[node name="Field" parent="Nav/Walls/Areas" instance=ExtResource( 1 )]
position = Vector2( 1170, 488 )

[node name="Pub" parent="Nav/Walls/Areas" instance=ExtResource( 6 )]
position = Vector2( 704, 491 )
