[gd_scene load_steps=5 format=2]

[ext_resource path="res://src/Npc/Smith/village_smith_idle.tres" type="SpriteFrames" id=1]
[ext_resource path="res://src/Npc/_NPC.tscn" type="PackedScene" id=2]
[ext_resource path="res://src/Effect/shadow_24.png" type="Texture" id=3]
[ext_resource path="res://src/Npc/Smith/Smith.gd" type="Script" id=4]

[node name="Smith" instance=ExtResource( 2 )]
script = ExtResource( 4 )

[node name="AnimatedSprite" parent="." index="4"]
position = Vector2( -16, -32 )
frames = ExtResource( 1 )
frame = 2
speed_scale = 2.6
centered = false

[node name="Shadow" parent="." index="6"]
texture = ExtResource( 3 )
