[gd_scene load_steps=7 format=2]

[ext_resource path="res://src/Projectile/_Projectile.tscn" type="PackedScene" id=1]
[ext_resource path="res://assets/Projectiles/slash.png" type="Texture" id=2]

[sub_resource type="AtlasTexture" id=1]
atlas = ExtResource( 2 )
region = Rect2( 0, 0, 16, 5 )

[sub_resource type="SpriteFrames" id=2]
animations = [ {
"frames": [ SubResource( 1 ) ],
"loop": true,
"name": "default",
"speed": 30.0
} ]

[sub_resource type="RectangleShape2D" id=3]
extents = Vector2( 4, 8 )

[sub_resource type="RectangleShape2D" id=4]
extents = Vector2( 4, 8 )

[node name="Bullet" instance=ExtResource( 1 )]
bullet_range = 0.125
init_coeff = 2
max_coeff = 8
initial_speed = 500
damage = 20
knockback_override = 30
create_sound = "res://assets/Sound/SFX/Battle/swing.wav"

[node name="AnimatedSprite" parent="." index="0"]
position = Vector2( 3, -8 )
rotation = 1.5708
frames = SubResource( 2 )
playing = true

[node name="HitBox" parent="HitBoxContainer" index="0"]
shape = SubResource( 3 )

[node name="CollisionShape2D" parent="." index="2"]
shape = SubResource( 4 )
