[gd_scene load_steps=3 format=2]

[ext_resource path="res://src/Item/_Item.tscn" type="PackedScene" id=1]
[ext_resource path="res://src/Item/Thrown/_Thrown.gd" type="Script" id=2]

[node name="Thrown" instance=ExtResource( 1 )]
script = ExtResource( 2 )

[node name="Sprite" parent="." index="0"]
position = Vector2( -0.5, -6 )
