%YAML 1.1
%TAG !u! tag:unity3d.com,2011:
--- !u!114 &11400000
MonoBehaviour:
  m_ObjectHideFlags: 0
  m_CorrespondingSourceObject: {fileID: 0}
  m_PrefabInstance: {fileID: 0}
  m_PrefabAsset: {fileID: 0}
  m_GameObject: {fileID: 0}
  m_Enabled: 1
  m_EditorHideFlags: 0
  m_Script: {fileID: 11500000, guid: f28c9ac49001e564488bbdcd23b76f54, type: 3}
  m_Name: PlayerAmmo2
  m_EditorClassIdentifier: 
  nameShort: 7.62mm
  nameLong: 7.62x51mm
  caliber: 1
  damage: 15
  amount: 500
  spriteUI: {fileID: 21300000, guid: b9b23ab562cc2f74ab177e6963d432af, type: 3}
