%YAML 1.1
%TAG !u! tag:unity3d.com,2011:
--- !u!1 &7868562019693424989
GameObject:
  m_ObjectHideFlags: 0
  m_CorrespondingSourceObject: {fileID: 0}
  m_PrefabInstance: {fileID: 0}
  m_PrefabAsset: {fileID: 0}
  serializedVersion: 6
  m_Component:
  - component: {fileID: 4919651016305761984}
  - component: {fileID: 6195410512689228018}
  - component: {fileID: 3051503172931779362}
  - component: {fileID: 6683481847871685702}
  m_Layer: 8
  m_Name: DeadStudent
  m_TagString: PayRespects
  m_Icon: {fileID: 0}
  m_NavMeshLayer: 0
  m_StaticEditorFlags: 0
  m_IsActive: 1
--- !u!4 &4919651016305761984
Transform:
  m_ObjectHideFlags: 0
  m_CorrespondingSourceObject: {fileID: 0}
  m_PrefabInstance: {fileID: 0}
  m_PrefabAsset: {fileID: 0}
  m_GameObject: {fileID: 7868562019693424989}
  m_LocalRotation: {x: -0, y: -0.78905284, z: -0, w: 0.6143254}
  m_LocalPosition: {x: 18.595873, y: 0, z: -13.654783}
  m_LocalScale: {x: 1, y: 1, z: 1}
  m_ConstrainProportionsScale: 0
  m_Children: []
  m_Father: {fileID: 0}
  m_RootOrder: 0
  m_LocalEulerAnglesHint: {x: 0, y: -104.194, z: 0}
--- !u!136 &6195410512689228018
CapsuleCollider:
  m_ObjectHideFlags: 0
  m_CorrespondingSourceObject: {fileID: 0}
  m_PrefabInstance: {fileID: 0}
  m_PrefabAsset: {fileID: 0}
  m_GameObject: {fileID: 7868562019693424989}
  m_Material: {fileID: 0}
  m_IsTrigger: 0
  m_Enabled: 1
  m_Radius: 0.5
  m_Height: 0.5
  m_Direction: 1
  m_Center: {x: 0, y: 0, z: 0}
--- !u!114 &3051503172931779362
MonoBehaviour:
  m_ObjectHideFlags: 0
  m_CorrespondingSourceObject: {fileID: 0}
  m_PrefabInstance: {fileID: 0}
  m_PrefabAsset: {fileID: 0}
  m_GameObject: {fileID: 7868562019693424989}
  m_Enabled: 1
  m_EditorHideFlags: 0
  m_Script: {fileID: 11500000, guid: 063913b232069524eb0bb1c306582ea0, type: 3}
  m_Name: 
  m_EditorClassIdentifier: 
  inkJSON: {fileID: 4900000, guid: 9c5cc4ca19547ff4392a11d69fc00757, type: 3}
  onStart:
    m_PersistentCalls:
      m_Calls:
      - m_Target: {fileID: 6683481847871685702}
        m_TargetAssemblyTypeName: PayRespectsInteraction, Assembly-CSharp
        m_MethodName: DialogueStart
        m_Mode: 0
        m_Arguments:
          m_ObjectArgument: {fileID: 0}
          m_ObjectArgumentAssemblyTypeName: UnityEngine.Object, UnityEngine
          m_IntArgument: 0
          m_FloatArgument: 0
          m_StringArgument: 
          m_BoolArgument: 0
        m_CallState: 2
  onChoice:
    m_PersistentCalls:
      m_Calls: []
  onBreak:
    m_PersistentCalls:
      m_Calls: []
  onFinish:
    m_PersistentCalls:
      m_Calls: []
--- !u!114 &6683481847871685702
MonoBehaviour:
  m_ObjectHideFlags: 0
  m_CorrespondingSourceObject: {fileID: 0}
  m_PrefabInstance: {fileID: 0}
  m_PrefabAsset: {fileID: 0}
  m_GameObject: {fileID: 7868562019693424989}
  m_Enabled: 1
  m_EditorHideFlags: 0
  m_Script: {fileID: 11500000, guid: 90e2957bc999edd478901dc3e4e7381e, type: 3}
  m_Name: 
  m_EditorClassIdentifier: 
  prompt: "Vzd\xE1t hold"
  dropChance: 30
  pagePrefab: {fileID: 8859285185999786988, guid: 90e133bce1f558548bb9ec495e66469a,
    type: 3}
