[gd_resource type="Resource" script_class="PatientAssignment" load_steps=4 format=3 uid="uid://bp4h8eqdfspm6"]

[ext_resource type="Script" path="res://game/characters/npcs/patients/scheduling/activities/individual_activities/stand_with_animation_activity.gd" id="1_kreh8"]
[ext_resource type="Script" path="res://game/characters/npcs/patients/scheduling/activities/activity_assignment.gd" id="2_s71ce"]

[sub_resource type="Resource" id="Resource_o5oc5"]
script = ExtResource("1_kreh8")
animation_name = "idle"
stand_spot_id = 0

[resource]
script = ExtResource("2_s71ce")
activity = SubResource("Resource_o5oc5")
_from_hours = 14
_from_minutes = 0
_to_hours = 19
_to_minutes = 0
