[gd_scene load_steps=2 format=3 uid="uid://ticgmlhw8b68"]

[ext_resource type="Texture2D" uid="uid://bo7rowyljd38e" path="res://sprites/ui/closed_notebook.png" id="1_y37o4"]

[node name="ClosedJournal" type="TextureButton"]
offset_top = 114.0
offset_right = 96.0
offset_bottom = 210.0
texture_normal = ExtResource("1_y37o4")
