[gd_scene load_steps=2 format=3 uid="uid://dx0nv3ouamqf7"]

[ext_resource type="Texture2D" uid="uid://c4xx7731ke4vb" path="res://sprites/props/static/paintings/painting1.png" id="1_dquhp"]

[node name="PaintingHolyMat" type="Sprite2D"]
texture = ExtResource("1_dquhp")
offset = Vector2(0, -26)
