[gd_scene load_steps=3 format=3 uid="uid://n35rw0jghvjp"]

[ext_resource type="Script" path="res://game/usable/bed.gd" id="1_4jj4r"]
[ext_resource type="PackedScene" uid="uid://clal56o1wp6hh" path="res://game/props/static/bed.tscn" id="1_rnyee"]

[node name="Node2D" type="Node2D"]
script = ExtResource("1_4jj4r")
use_distance = 100.0

[node name="Bed" parent="." instance=ExtResource("1_rnyee")]
position = Vector2(7.62939e-06, 76)
