[gd_resource type="Resource" script_class="Direction" load_steps=2 format=3 uid="uid://d07roh5cfn6f8"]

[ext_resource type="Script" path="res://misc/direction/direction.gd" id="1_00gt8"]

[resource]
script = ExtResource("1_00gt8")
direction = 2
