[gd_scene load_steps=3 format=3 uid="uid://257ke5socl1j"]

[ext_resource type="Texture2D" uid="uid://p2ejph67nqlw" path="res://sprites/props/static/bookshelf.png" id="1_ex5na"]

[sub_resource type="RectangleShape2D" id="RectangleShape2D_0sat7"]
size = Vector2(32, 16.4)

[node name="Bookshelf" type="StaticBody2D"]
scale = Vector2(5, 5)

[node name="Sprite2D" type="Sprite2D" parent="."]
texture = ExtResource("1_ex5na")

[node name="CollisionShape2D" type="CollisionShape2D" parent="."]
position = Vector2(0, 7.8)
scale = Vector2(1, 1)
shape = SubResource("RectangleShape2D_0sat7")
