[gd_scene load_steps=3 format=3 uid="uid://c2awoplxi25oi"]

[ext_resource type="Texture2D" uid="uid://bh28kwpmihicy" path="res://sprites/props/static/small_filled_double_locker.png" id="1_cf0fi"]

[sub_resource type="RectangleShape2D" id="RectangleShape2D_1s64t"]
size = Vector2(135, 30.5)

[node name="DoubleLockerFilled" type="StaticBody2D"]

[node name="Sprite2D" type="Sprite2D" parent="."]
scale = Vector2(0.25, 0.25)
texture = ExtResource("1_cf0fi")
offset = Vector2(0, -200)

[node name="CollisionShape2D" type="CollisionShape2D" parent="."]
position = Vector2(0, -15.25)
shape = SubResource("RectangleShape2D_1s64t")
