[gd_scene load_steps=4 format=3 uid="uid://b35c2i7t2kksh"]

[ext_resource type="Texture2D" uid="uid://bjuaktc07bq8o" path="res://sprites/props/static/armchair_front.png" id="1_blojo"]

[sub_resource type="RectangleShape2D" id="RectangleShape2D_8qw0e"]
size = Vector2(240, 155)

[sub_resource type="RectangleShape2D" id="RectangleShape2D_6wuvo"]
size = Vector2(210, 30)

[node name="ArmchairFront" type="StaticBody2D"]
scale = Vector2(0.25, 0.25)

[node name="Sprite2D" type="Sprite2D" parent="."]
texture = ExtResource("1_blojo")
offset = Vector2(0, -105)

[node name="UpCollision" type="CollisionShape2D" parent="."]
position = Vector2(0, -107.5)
shape = SubResource("RectangleShape2D_8qw0e")

[node name="DownCollision" type="CollisionShape2D" parent="."]
position = Vector2(0, -15)
shape = SubResource("RectangleShape2D_6wuvo")
