[gd_scene load_steps=3 format=3 uid="uid://clal56o1wp6hh"]

[ext_resource type="Texture2D" uid="uid://bc8f6m8gv88vj" path="res://sprites/props/static/bed.png" id="1_elrl2"]

[sub_resource type="RectangleShape2D" id="RectangleShape2D_7nfuj"]
size = Vector2(82.625, 94.125)

[node name="Bed" type="StaticBody2D"]
scale = Vector2(1.75, 1.75)

[node name="Sprite2D" type="Sprite2D" parent="."]
scale = Vector2(0.25, 0.25)
texture = ExtResource("1_elrl2")
offset = Vector2(0, -220)

[node name="CollisionShape2D" type="CollisionShape2D" parent="."]
position = Vector2(0, -46.9375)
shape = SubResource("RectangleShape2D_7nfuj")
