[gd_scene load_steps=2 format=3 uid="uid://rdcn01tvcixf"]

[ext_resource type="Script" path="res://ui/actionable/interact_ui.gd" id="1_1euvg"]

[node name="InteractUI" type="CanvasLayer"]
script = ExtResource("1_1euvg")

[node name="Panel" type="Panel" parent="."]
unique_name_in_owner = true
anchors_preset = 3
anchor_left = 1.0
anchor_top = 1.0
anchor_right = 1.0
anchor_bottom = 1.0
offset_left = -1081.0
offset_top = -120.0
offset_right = -21.0
offset_bottom = -22.0
grow_horizontal = 0
grow_vertical = 0

[node name="MarginContainer" type="MarginContainer" parent="Panel"]
unique_name_in_owner = true
layout_mode = 1
anchors_preset = 15
anchor_right = 1.0
anchor_bottom = 1.0
grow_horizontal = 2
grow_vertical = 2
theme_override_constants/margin_left = 10
theme_override_constants/margin_top = 10
theme_override_constants/margin_right = 10
theme_override_constants/margin_bottom = 10

[node name="Text" type="Label" parent="Panel/MarginContainer"]
unique_name_in_owner = true
layout_mode = 2
theme_override_font_sizes/font_size = 24
text = "50"

[node name="FakeText" type="Label" parent="."]
unique_name_in_owner = true
visible = false
offset_right = 40.0
offset_bottom = 23.0
