[gd_scene load_steps=2 format=3 uid="uid://dpb5qsxo8g4eq"]

[ext_resource type="Texture2D" uid="uid://c7jfub6vamnms" path="res://sprites/props/static/paintings/painting3.png" id="1_gvell"]

[node name="PaintingShapes" type="Sprite2D"]
texture = ExtResource("1_gvell")
offset = Vector2(0, -26)
