[gd_scene load_steps=3 format=3 uid="uid://cmouv61lidmx3"]

[ext_resource type="Texture2D" uid="uid://dsc11mco88bhw" path="res://sprites/props/static/stove.png" id="1_f2t8w"]

[sub_resource type="RectangleShape2D" id="RectangleShape2D_ptte1"]
size = Vector2(18, 15)

[node name="Stove" type="StaticBody2D"]
scale = Vector2(4, 4)

[node name="Sprite2D" type="Sprite2D" parent="."]
texture = ExtResource("1_f2t8w")

[node name="CollisionShape2D" type="CollisionShape2D" parent="."]
position = Vector2(0, 5.5)
shape = SubResource("RectangleShape2D_ptte1")
