[gd_resource type="Resource" script_class="GuardAssignmentWithNumbers" load_steps=2 format=3 uid="uid://5s3i6w1b75u6"]

[ext_resource type="Script" path="res://game/characters/npcs/guards/scheduling/assignments/guard_assignment_with_numbers.gd" id="1_046on"]

[resource]
script = ExtResource("1_046on")
_from_hours = 0
_from_minutes = 0
_to_hours = 7
_to_minutes = 0
duty_id = 19
