[gd_resource type="Resource" script_class="PatientAssignment" load_steps=4 format=3 uid="uid://38m7ckbkdivj"]

[ext_resource type="Script" path="res://game/characters/npcs/patients/scheduling/activities/individual_activities/eat_activity.gd" id="1_dklwb"]
[ext_resource type="Script" path="res://game/characters/npcs/patients/scheduling/activities/activity_assignment.gd" id="2_jjbkl"]

[sub_resource type="Resource" id="Resource_gpdct"]
script = ExtResource("1_dklwb")

[resource]
script = ExtResource("2_jjbkl")
activity = SubResource("Resource_gpdct")
_from_hours = 19
_from_minutes = 0
_to_hours = 21
_to_minutes = 30
