[gd_scene load_steps=2 format=3 uid="uid://cc5k51uisff1m"]

[ext_resource type="Script" path="res://game/characters/npcs/new_guards/guard_activities/BaseGuardActivity.gd" id="1_j5rh5"]

[node name="BaseGuardActivity" type="Node"]
script = ExtResource("1_j5rh5")
