[gd_scene load_steps=3 format=3 uid="uid://dv850tf7e6usa"]

[ext_resource type="Texture2D" uid="uid://rh20m2cm6vng" path="res://sprites/props/static/toilet.png" id="1_i21kx"]

[sub_resource type="RectangleShape2D" id="RectangleShape2D_ptte1"]
size = Vector2(225, 223.5)

[node name="Toilet" type="StaticBody2D"]
scale = Vector2(0.2, 0.2)

[node name="Sprite2D" type="Sprite2D" parent="."]
texture = ExtResource("1_i21kx")

[node name="CollisionShape2D" type="CollisionShape2D" parent="."]
position = Vector2(0, 68.25)
shape = SubResource("RectangleShape2D_ptte1")
