[gd_scene load_steps=2 format=3 uid="uid://cghmd0e0i1ljg"]

[ext_resource type="Texture2D" uid="uid://g21sxfyiqcdr" path="res://sprites/props/static/wooden_chair_side.png" id="1_kbdpx"]

[node name="WoodenChairSide" type="StaticBody2D"]
scale = Vector2(5, 5)

[node name="Sprite2D" type="Sprite2D" parent="."]
texture = ExtResource("1_kbdpx")

[node name="CollisionShape2D" type="CollisionShape2D" parent="."]
position = Vector2(1, 2)
