[gd_scene load_steps=2 format=3 uid="uid://dsbaaq4gmcgv7"]

[ext_resource type="Script" path="res://game/console/console.gd" id="1_moq8r"]

[node name="Console" type="Control"]
process_mode = 3
top_level = true
z_index = 7
layout_mode = 3
anchors_preset = 15
anchor_right = 1.0
anchor_bottom = 1.0
grow_horizontal = 2
grow_vertical = 2
script = ExtResource("1_moq8r")

[node name="CanvasLayer" type="CanvasLayer" parent="."]
layer = 5
visible = false

[node name="ColorRect" type="ColorRect" parent="CanvasLayer"]
offset_right = 1920.0
offset_bottom = 1080.0
color = Color(0.196078, 0.196078, 0.196078, 0.188235)

[node name="working_directory" type="Label" parent="CanvasLayer"]
offset_left = 1.0
offset_top = 952.0
offset_right = 1922.0
offset_bottom = 1078.0

[node name="input" type="LineEdit" parent="CanvasLayer"]
offset_left = 1.0
offset_top = 830.0
offset_right = 1921.0
offset_bottom = 939.0
theme_override_font_sizes/font_size = 30

[node name="output" type="RichTextLabel" parent="CanvasLayer"]
offset_right = 1916.0
offset_bottom = 819.0
text = "Welcome to the dev console. Enter \"help\" for help."
scroll_following = true

[connection signal="text_submitted" from="CanvasLayer/input" to="." method="_on_input_text_submitted"]
