[gd_scene load_steps=3 format=3 uid="uid://ct718xqqtad7k"]

[ext_resource type="Texture2D" uid="uid://cnmvwvdrvt4vo" path="res://sprites/props/static/toilet_doors.png" id="1_tcrgs"]

[sub_resource type="RectangleShape2D" id="RectangleShape2D_ptte1"]
size = Vector2(10, 19)

[node name="ToiletDoor" type="StaticBody2D"]
scale = Vector2(10, 10)

[node name="Sprite2D" type="Sprite2D" parent="."]
texture = ExtResource("1_tcrgs")

[node name="CollisionShape2D" type="CollisionShape2D" parent="."]
position = Vector2(0, 1.5)
shape = SubResource("RectangleShape2D_ptte1")
