[gd_scene load_steps=3 format=3 uid="uid://cno05mlpd70d2"]

[ext_resource type="Texture2D" uid="uid://bpy7n7fipuhpj" path="res://sprites/props/static/bed_table.png" id="1_iqh5e"]

[sub_resource type="RectangleShape2D" id="RectangleShape2D_aw4fm"]
size = Vector2(8, 8.8)

[node name="BedTable" type="StaticBody2D"]
scale = Vector2(1.5, 1.5)

[node name="Sprite2D" type="Sprite2D" parent="."]
scale = Vector2(5, 5)
texture = ExtResource("1_iqh5e")
offset = Vector2(0, -5)

[node name="CollisionShape2D" type="CollisionShape2D" parent="."]
position = Vector2(0, -22)
scale = Vector2(5, 5)
shape = SubResource("RectangleShape2D_aw4fm")
