[gd_resource type="Resource" script_class="GuardAssignmentWithNumbers" load_steps=2 format=3 uid="uid://c2tisystpkcc7"]

[ext_resource type="Script" path="res://game/characters/npcs/guards/scheduling/assignments/guard_assignment_with_numbers.gd" id="1_glf2e"]

[resource]
script = ExtResource("1_glf2e")
_from_hours = 7
_from_minutes = 0
_to_hours = 11
_to_minutes = 0
duty_id = 11
