%YAML 1.1
%TAG !u! tag:unity3d.com,2011:
--- !u!114 &11400000
MonoBehaviour:
  m_ObjectHideFlags: 0
  m_CorrespondingSourceObject: {fileID: 0}
  m_PrefabInstance: {fileID: 0}
  m_PrefabAsset: {fileID: 0}
  m_GameObject: {fileID: 0}
  m_Enabled: 1
  m_EditorHideFlags: 0
  m_Script: {fileID: 11500000, guid: e95750f108e433543aef0099027763ad, type: 3}
  m_Name: krystof-before-plzen
  m_EditorClassIdentifier: 
  entryLines:
  - text: "Bez pomluv ze Staropramenu a Starobrna se n\xE1m v Bran\xEDku za\u010D\xEDn\xE1
      moc da\u0159it!"
    speakerName: "Ky\u0161tof"
    portrait: {fileID: 21300000, guid: acbefb7de517d05429e8f76e1b6e54a5, type: 3}
    audio: {fileID: 0}
  - text: "Je tu ale je\u0161t\u011B n\u011Bkdo, kdo Br\xE1n\xED Bran\xEDku v r\u016Fstu
      a blahobytu!"
    speakerName: "Kry\u0161tof"
    portrait: {fileID: 21300000, guid: acbefb7de517d05429e8f76e1b6e54a5, type: 3}
    audio: {fileID: 0}
  - text: "Co\u017Ee??!? A kdo?"
    speakerName: Branice
    portrait: {fileID: 21300000, guid: 669aaa38aa0f8f244aa3ca8c5d6b8375, type: 3}
    audio: {fileID: 0}
  - text: Prazdroj!
    speakerName: "Kry\u0161tof"
    portrait: {fileID: 21300000, guid: acbefb7de517d05429e8f76e1b6e54a5, type: 3}
    audio: {fileID: 0}
  - text: Prazdroj?
    speakerName: Branice
    portrait: {fileID: 21300000, guid: 669aaa38aa0f8f244aa3ca8c5d6b8375, type: 3}
    audio: {fileID: 0}
  - text: "Je to tak, Plze\u0148sk\xFD Prazdroj, v\xED\u0161 pro\u010D se mu \u0159\xEDk\xE1
      prazdroj?"
    speakerName: "Kry\u0161tof"
    portrait: {fileID: 21300000, guid: acbefb7de517d05429e8f76e1b6e54a5, type: 3}
    audio: {fileID: 0}
  - text: "Proto\u017Ee je u\u017E od PRAd\xE1vna ZDROJem nePRAvdiv\xFDch pomluv
      o na\u0161em pivovaru!"
    speakerName: "Kry\u0161tof"
    portrait: {fileID: 21300000, guid: acbefb7de517d05429e8f76e1b6e54a5, type: 3}
    audio: {fileID: 0}
  - text: "Dob\u0159e, vzh\u016Fru tedy do Plzn\u011B."
    speakerName: Branice
    portrait: {fileID: 21300000, guid: 669aaa38aa0f8f244aa3ca8c5d6b8375, type: 3}
    audio: {fileID: 0}
  choices: []
