%YAML 1.1
%TAG !u! tag:unity3d.com,2011:
--- !u!114 &11400000
MonoBehaviour:
  m_ObjectHideFlags: 0
  m_CorrespondingSourceObject: {fileID: 0}
  m_PrefabInstance: {fileID: 0}
  m_PrefabAsset: {fileID: 0}
  m_GameObject: {fileID: 0}
  m_Enabled: 1
  m_EditorHideFlags: 0
  m_Script: {fileID: 11500000, guid: e95750f108e433543aef0099027763ad, type: 3}
  m_Name: unetice-krystof-gives-bottle
  m_EditorClassIdentifier: 
  entryLines:
  - text: "St\u016Fj! Nem\xE1me tu\u0161en\xED, co za hr\u016Fzy m\u016F\u017Ee vevnit\u0159
      b\xFDt. Pot\u0159ebuje\u0161 n\u011Bco na obranu. Vem si t\u0159eba tuhle pr\xE1zdnou
      lahev od Bran\xEDku. M\u016F\u017Ee\u0161 s n\xED n\u011Bkoho majznout pomoc\xED
      [C]."
    speakerName: "Kry\u0161tof"
    portrait: {fileID: 21300000, guid: acbefb7de517d05429e8f76e1b6e54a5, type: 3}
    audio: {fileID: 0}
  choices:
  - choiceText: Nerozbije se?
    isEnding: 0
    output: 
    dialogue:
    - text: "A nerozbije se ta lahev, jen co s n\xED n\u011Bkoho majznu?"
      speakerName: Branice
      portrait: {fileID: 21300000, guid: 669aaa38aa0f8f244aa3ca8c5d6b8375, type: 3}
      audio: {fileID: 0}
    - text: "Ha! Mysl\xED\u0161, \u017Ee si s sebou beru oby\u010Dejn\xFD lahve?
        Tohle je speci\xE1ln\xED edice z nerozbitn\xE9ho skla! Pouze pro v\xFDjime\u010Dn\xE9
        lidi a v\xFDjime\u010Dn\xE9 situace."
      speakerName: "Kry\u0161tof"
      portrait: {fileID: 21300000, guid: acbefb7de517d05429e8f76e1b6e54a5, type: 3}
      audio: {fileID: 0}
  - choiceText: Jdu tam
    isEnding: 1
    output: 
    dialogue:
    - text: "P\u011Bkn\u011B d\u011Bkuju teda. A n\u011Bco m\xE9n\u011B hroziv\xE9ho
        bys tam nem\u011Bl? T\u0159eba balen\xED \u017Ev\xFDka\u010Dek?"
      speakerName: Branice
      portrait: {fileID: 21300000, guid: 669aaa38aa0f8f244aa3ca8c5d6b8375, type: 3}
      audio: {fileID: 0}
    - text: "Moc kec\xE1\u0161, m\xE1lo d\u011Bl\xE1\u0161. \u0160up dovnit\u0159."
      speakerName: "Kry\u0161tof"
      portrait: {fileID: 21300000, guid: acbefb7de517d05429e8f76e1b6e54a5, type: 3}
      audio: {fileID: 0}
