%YAML 1.1
%TAG !u! tag:unity3d.com,2011:
--- !u!114 &11400000
MonoBehaviour:
  m_ObjectHideFlags: 0
  m_CorrespondingSourceObject: {fileID: 0}
  m_PrefabInstance: {fileID: 0}
  m_PrefabAsset: {fileID: 0}
  m_GameObject: {fileID: 0}
  m_Enabled: 1
  m_EditorHideFlags: 0
  m_Script: {fileID: 11500000, guid: e95750f108e433543aef0099027763ad, type: 3}
  m_Name: skladnik-branik-broken
  m_EditorClassIdentifier: 
  entryLines:
  - text: "Co m\xE1m vysklad\u0148ovat, kdy\u017E nevyr\xE1b\xEDme?"
    speakerName: "Skladn\xEDk L\xE1\u010Fa"
    portrait: {fileID: 21300000, guid: 971d118c7cae7a34fa4de276e339f7b3, type: 3}
    audio: {fileID: 0}
  choices: []
