%YAML 1.1
%TAG !u! tag:unity3d.com,2011:
--- !u!114 &11400000
MonoBehaviour:
  m_ObjectHideFlags: 0
  m_CorrespondingSourceObject: {fileID: 0}
  m_PrefabInstance: {fileID: 0}
  m_PrefabAsset: {fileID: 0}
  m_GameObject: {fileID: 0}
  m_Enabled: 1
  m_EditorHideFlags: 0
  m_Script: {fileID: 11500000, guid: e95750f108e433543aef0099027763ad, type: 3}
  m_Name: kvasnik-deafult
  m_EditorClassIdentifier: 
  entryLines:
  - text: "Kva\u0161en\xED, to je m\xE9 nad\u0161en\xED."
    speakerName: "Kvasn\xEDk V\xE1clav"
    portrait: {fileID: 21300000, guid: a2b1f63327e8dba4db976c810ab9ab12, type: 3}
    audio: {fileID: 0}
  choices: []
