%YAML 1.1
%TAG !u! tag:unity3d.com,2011:
--- !u!114 &11400000
MonoBehaviour:
  m_ObjectHideFlags: 0
  m_CorrespondingSourceObject: {fileID: 0}
  m_PrefabInstance: {fileID: 0}
  m_PrefabAsset: {fileID: 0}
  m_GameObject: {fileID: 0}
  m_Enabled: 1
  m_EditorHideFlags: 0
  m_Script: {fileID: 11500000, guid: e95750f108e433543aef0099027763ad, type: 3}
  m_Name: kvasnik-heal
  m_EditorClassIdentifier: 
  entryLines:
  - text: "Ob\u010Das zkou\u0161\xEDm n\u011Bjak\xE9 nov\xE9 receptury bokem. A posledn\xED
      v\xE1rka se mi fakt poda\u0159ila. M\xE1 takov\xE9 uvol\u0148uj\xEDc\xED, a\u017E
      l\xE9\u010Debn\xE9 \xFA\u010Dinky. Nechce\u0161 ko\u0161tnout?"
    speakerName: "Kvasn\xEDk V\xE1clav"
    portrait: {fileID: 21300000, guid: a2b1f63327e8dba4db976c810ab9ab12, type: 3}
    audio: {fileID: 0}
  choices:
  - choiceText: "Jasn\u011B!"
    isEnding: 1
    output: heal
    dialogue:
    - text: "To zkus\xEDm velmi r\xE1da."
      speakerName: Branice
      portrait: {fileID: 21300000, guid: 669aaa38aa0f8f244aa3ca8c5d6b8375, type: 3}
      audio: {fileID: 0}
    - text: "P\xE1ni. V\xE1\u017En\u011B se c\xEDt\xEDm dob\u0159e. D\xEDky moc."
      speakerName: Branice
      portrait: {fileID: 21300000, guid: 669aaa38aa0f8f244aa3ca8c5d6b8375, type: 3}
      audio: {fileID: 0}
  - choiceText: "Te\u010F ne."
    isEnding: 1
    output: 
    dialogue:
    - text: "Te\u010Fka ne, mo\u017En\xE1 jindy?"
      speakerName: Branice
      portrait: {fileID: 21300000, guid: 669aaa38aa0f8f244aa3ca8c5d6b8375, type: 3}
      audio: {fileID: 0}
    - text: "Pez probl\xE9mu d\u011Bv\u010De, budu tady na tebe \u010Dekat."
      speakerName: "Kvasn\xEDk V\xE1clav"
      portrait: {fileID: 21300000, guid: a2b1f63327e8dba4db976c810ab9ab12, type: 3}
      audio: {fileID: 0}
