{
  "main": {
    "id": "5c35f6de2c8494ea",
    "type": "split",
    "children": [
      {
        "id": "4d8af07de4540c6a",
        "type": "tabs",
        "children": [
          {
            "id": "71ee63ec058da589",
            "type": "leaf",
            "state": {
              "type": "markdown",
              "state": {
                "file": "Svět.md",
                "mode": "source",
                "source": false
              }
            }
          },
          {
            "id": "fbd43c9da7be1174",
            "type": "leaf",
            "state": {
              "type": "markdown",
              "state": {
                "file": "Scény/Staropramen.md",
                "mode": "preview",
                "source": true
              }
            }
          },
          {
            "id": "121816db5b876772",
            "type": "leaf",
            "state": {
              "type": "markdown",
              "state": {
                "file": "Scény/Únětice.md",
                "mode": "source",
                "source": false
              }
            }
          }
        ]
      }
    ],
    "direction": "vertical"
  },
  "left": {
    "id": "5bc97ee9dfd4e611",
    "type": "split",
    "children": [
      {
        "id": "a2614e7ec8c88fc1",
        "type": "tabs",
        "children": [
          {
            "id": "dbf238ff4da9a748",
            "type": "leaf",
            "state": {
              "type": "file-explorer",
              "state": {
                "sortOrder": "alphabetical"
              }
            }
          },
          {
            "id": "3f84ce914345ab95",
            "type": "leaf",
            "state": {
              "type": "search",
              "state": {
                "query": "",
                "matchingCase": false,
                "explainSearch": false,
                "collapseAll": false,
                "extraContext": false,
                "sortOrder": "alphabetical"
              }
            }
          },
          {
            "id": "664eef8f197a71fa",
            "type": "leaf",
            "state": {
              "type": "bookmarks",
              "state": {}
            }
          }
        ]
      }
    ],
    "direction": "horizontal",
    "width": 300
  },
  "right": {
    "id": "be6d5f8e8a9feb1e",
    "type": "split",
    "children": [
      {
        "id": "849046f1c5c2128d",
        "type": "tabs",
        "children": [
          {
            "id": "63ead8fb60157a5a",
            "type": "leaf",
            "state": {
              "type": "backlink",
              "state": {
                "file": "Svět.md",
                "collapseAll": false,
                "extraContext": false,
                "sortOrder": "alphabetical",
                "showSearch": false,
                "searchQuery": "",
                "backlinkCollapsed": false,
                "unlinkedCollapsed": true
              }
            }
          },
          {
            "id": "4e91c0cfd2614a12",
            "type": "leaf",
            "state": {
              "type": "outgoing-link",
              "state": {
                "file": "Svět.md",
                "linksCollapsed": false,
                "unlinkedCollapsed": true
              }
            }
          },
          {
            "id": "4dd9b1cb98e21ea2",
            "type": "leaf",
            "state": {
              "type": "tag",
              "state": {
                "sortOrder": "frequency",
                "useHierarchy": true
              }
            }
          },
          {
            "id": "29d01b56227f9222",
            "type": "leaf",
            "state": {
              "type": "outline",
              "state": {
                "file": "Svět.md"
              }
            }
          }
        ],
        "currentTab": 3
      }
    ],
    "direction": "horizontal",
    "width": 300
  },
  "left-ribbon": {
    "hiddenItems": {
      "switcher:Open quick switcher": false,
      "graph:Open graph view": false,
      "canvas:Create new canvas": false,
      "daily-notes:Open today's daily note": false,
      "templates:Insert template": false,
      "command-palette:Open command palette": false
    }
  },
  "active": "71ee63ec058da589",
  "lastOpenFiles": [
    "Scény/Branický pivovar.md",
    "Scény/Plzeň.md",
    "Scény/Starobrno.md",
    "Scény/Staropramen.md",
    "Scény/Starobrno.md",
    "Scény/Plzeň.md",
    "Scény/Únětice.md",
    "attachments/Pasted image 20231020171644.png",
    "attachments/Pasted image 20231020171542.png",
    "attachments/20231020_113849.jpg",
    "index.md",
    "attachments/20231018_110139.jpg",
    "attachments/20231018_103606.jpg",
    "attachments/DSC_4958-444-1-1145176236.jpg",
    "attachments/unetice_zahradka_koncept.jpg",
    "attachments/unetice_zidka.png",
    "attachments/uneticky-pivovar-1202-3967365149.jpg",
    "attachments/unetice_poohled1.png",
    "attachments/~0231018_103606.tmp",
    "Scény",
    "Untitled.canvas",
    "attachments"
  ]
}