%YAML 1.1
%TAG !u! tag:unity3d.com,2011:
--- !u!114 &11400000
MonoBehaviour:
  m_ObjectHideFlags: 0
  m_CorrespondingSourceObject: {fileID: 0}
  m_PrefabInstance: {fileID: 0}
  m_PrefabAsset: {fileID: 0}
  m_GameObject: {fileID: 0}
  m_Enabled: 1
  m_EditorHideFlags: 0
  m_Script: {fileID: 11500000, guid: af0faa17d9dfdba438d44aaf3959e995, type: 3}
  m_Name: B7
  m_EditorClassIdentifier: 
  portrait: {fileID: 21300000, guid: 984b899f157483542b3f2ac78674a193, type: 3}
  lines:
  - Who would believe a crazy conspiracy theorist?
  - No one.
  - And I don't want to draw too much attention to myself anyways.
  - The officers can arrest you for much less.
  answers: []
  answerLeadingTo: []
  leadsTo: {fileID: 11400000, guid: 810a164614fac1d4aae59dde6033096a, type: 2}
  speaker: Buddy
  actionToTrigger: {fileID: 0}
