%YAML 1.1
%TAG !u! tag:unity3d.com,2011:
--- !u!1 &4908557679981996192
GameObject:
  m_ObjectHideFlags: 0
  m_CorrespondingSourceObject: {fileID: 0}
  m_PrefabInstance: {fileID: 0}
  m_PrefabAsset: {fileID: 0}
  serializedVersion: 6
  m_Component:
  - component: {fileID: 4439703259785118850}
  - component: {fileID: 3068151813719030923}
  m_Layer: 0
  m_Name: Church
  m_TagString: Untagged
  m_Icon: {fileID: 0}
  m_NavMeshLayer: 0
  m_StaticEditorFlags: 0
  m_IsActive: 1
--- !u!4 &4439703259785118850
Transform:
  m_ObjectHideFlags: 0
  m_CorrespondingSourceObject: {fileID: 0}
  m_PrefabInstance: {fileID: 0}
  m_PrefabAsset: {fileID: 0}
  m_GameObject: {fileID: 4908557679981996192}
  serializedVersion: 2
  m_LocalRotation: {x: 0, y: 0, z: 0, w: 1}
  m_LocalPosition: {x: 0, y: 0, z: 0}
  m_LocalScale: {x: 1, y: 1, z: 1}
  m_ConstrainProportionsScale: 0
  m_Children:
  - {fileID: 4758689629258463983}
  m_Father: {fileID: 0}
  m_LocalEulerAnglesHint: {x: 0, y: 0, z: 0}
--- !u!156049354 &3068151813719030923
Grid:
  m_ObjectHideFlags: 0
  m_CorrespondingSourceObject: {fileID: 0}
  m_PrefabInstance: {fileID: 0}
  m_PrefabAsset: {fileID: 0}
  m_GameObject: {fileID: 4908557679981996192}
  m_Enabled: 1
  m_CellSize: {x: 1, y: 1, z: 0}
  m_CellGap: {x: 0, y: 0, z: 0}
  m_CellLayout: 0
  m_CellSwizzle: 0
--- !u!1 &5117006086880631642
GameObject:
  m_ObjectHideFlags: 0
  m_CorrespondingSourceObject: {fileID: 0}
  m_PrefabInstance: {fileID: 0}
  m_PrefabAsset: {fileID: 0}
  serializedVersion: 6
  m_Component:
  - component: {fileID: 4758689629258463983}
  - component: {fileID: 655306368261031193}
  - component: {fileID: 1387755453865362174}
  m_Layer: 0
  m_Name: Layer1
  m_TagString: Untagged
  m_Icon: {fileID: 0}
  m_NavMeshLayer: 0
  m_StaticEditorFlags: 0
  m_IsActive: 1
--- !u!4 &4758689629258463983
Transform:
  m_ObjectHideFlags: 0
  m_CorrespondingSourceObject: {fileID: 0}
  m_PrefabInstance: {fileID: 0}
  m_PrefabAsset: {fileID: 0}
  m_GameObject: {fileID: 5117006086880631642}
  serializedVersion: 2
  m_LocalRotation: {x: -0, y: -0, z: -0, w: 1}
  m_LocalPosition: {x: 0, y: 0, z: 0}
  m_LocalScale: {x: 1, y: 1, z: 1}
  m_ConstrainProportionsScale: 0
  m_Children: []
  m_Father: {fileID: 4439703259785118850}
  m_LocalEulerAnglesHint: {x: 0, y: 0, z: 0}
--- !u!1839735485 &655306368261031193
Tilemap:
  m_ObjectHideFlags: 0
  m_CorrespondingSourceObject: {fileID: 0}
  m_PrefabInstance: {fileID: 0}
  m_PrefabAsset: {fileID: 0}
  m_GameObject: {fileID: 5117006086880631642}
  m_Enabled: 1
  m_Tiles:
  - first: {x: -2, y: -3, z: 0}
    second:
      serializedVersion: 2
      m_TileIndex: 22
      m_TileSpriteIndex: 22
      m_TileMatrixIndex: 0
      m_TileColorIndex: 0
      m_TileObjectToInstantiateIndex: 65535
      dummyAlignment: 0
      m_AllTileFlags: 1073741825
  - first: {x: -1, y: -3, z: 0}
    second:
      serializedVersion: 2
      m_TileIndex: 23
      m_TileSpriteIndex: 23
      m_TileMatrixIndex: 0
      m_TileColorIndex: 0
      m_TileObjectToInstantiateIndex: 65535
      dummyAlignment: 0
      m_AllTileFlags: 1073741825
  - first: {x: -2, y: -2, z: 0}
    second:
      serializedVersion: 2
      m_TileIndex: 20
      m_TileSpriteIndex: 20
      m_TileMatrixIndex: 0
      m_TileColorIndex: 0
      m_TileObjectToInstantiateIndex: 65535
      dummyAlignment: 0
      m_AllTileFlags: 1073741825
  - first: {x: -1, y: -2, z: 0}
    second:
      serializedVersion: 2
      m_TileIndex: 21
      m_TileSpriteIndex: 21
      m_TileMatrixIndex: 0
      m_TileColorIndex: 0
      m_TileObjectToInstantiateIndex: 65535
      dummyAlignment: 0
      m_AllTileFlags: 1073741825
  - first: {x: -2, y: -1, z: 0}
    second:
      serializedVersion: 2
      m_TileIndex: 16
      m_TileSpriteIndex: 16
      m_TileMatrixIndex: 0
      m_TileColorIndex: 0
      m_TileObjectToInstantiateIndex: 65535
      dummyAlignment: 0
      m_AllTileFlags: 1073741825
  - first: {x: 3, y: -1, z: 0}
    second:
      serializedVersion: 2
      m_TileIndex: 17
      m_TileSpriteIndex: 17
      m_TileMatrixIndex: 0
      m_TileColorIndex: 0
      m_TileObjectToInstantiateIndex: 65535
      dummyAlignment: 0
      m_AllTileFlags: 1073741825
  - first: {x: 4, y: -1, z: 0}
    second:
      serializedVersion: 2
      m_TileIndex: 18
      m_TileSpriteIndex: 18
      m_TileMatrixIndex: 0
      m_TileColorIndex: 0
      m_TileObjectToInstantiateIndex: 65535
      dummyAlignment: 0
      m_AllTileFlags: 1073741825
  - first: {x: 5, y: -1, z: 0}
    second:
      serializedVersion: 2
      m_TileIndex: 19
      m_TileSpriteIndex: 19
      m_TileMatrixIndex: 0
      m_TileColorIndex: 0
      m_TileObjectToInstantiateIndex: 65535
      dummyAlignment: 0
      m_AllTileFlags: 1073741825
  - first: {x: -1, y: 0, z: 0}
    second:
      serializedVersion: 2
      m_TileIndex: 10
      m_TileSpriteIndex: 10
      m_TileMatrixIndex: 0
      m_TileColorIndex: 0
      m_TileObjectToInstantiateIndex: 65535
      dummyAlignment: 0
      m_AllTileFlags: 1073741825
  - first: {x: 0, y: 0, z: 0}
    second:
      serializedVersion: 2
      m_TileIndex: 11
      m_TileSpriteIndex: 11
      m_TileMatrixIndex: 0
      m_TileColorIndex: 0
      m_TileObjectToInstantiateIndex: 65535
      dummyAlignment: 0
      m_AllTileFlags: 1073741825
  - first: {x: 1, y: 0, z: 0}
    second:
      serializedVersion: 2
      m_TileIndex: 12
      m_TileSpriteIndex: 12
      m_TileMatrixIndex: 0
      m_TileColorIndex: 0
      m_TileObjectToInstantiateIndex: 65535
      dummyAlignment: 0
      m_AllTileFlags: 1073741825
  - first: {x: 3, y: 0, z: 0}
    second:
      serializedVersion: 2
      m_TileIndex: 13
      m_TileSpriteIndex: 13
      m_TileMatrixIndex: 0
      m_TileColorIndex: 0
      m_TileObjectToInstantiateIndex: 65535
      dummyAlignment: 0
      m_AllTileFlags: 1073741825
  - first: {x: 4, y: 0, z: 0}
    second:
      serializedVersion: 2
      m_TileIndex: 14
      m_TileSpriteIndex: 14
      m_TileMatrixIndex: 0
      m_TileColorIndex: 0
      m_TileObjectToInstantiateIndex: 65535
      dummyAlignment: 0
      m_AllTileFlags: 1073741825
  - first: {x: 5, y: 0, z: 0}
    second:
      serializedVersion: 2
      m_TileIndex: 15
      m_TileSpriteIndex: 15
      m_TileMatrixIndex: 0
      m_TileColorIndex: 0
      m_TileObjectToInstantiateIndex: 65535
      dummyAlignment: 0
      m_AllTileFlags: 1073741825
  - first: {x: -1, y: 1, z: 0}
    second:
      serializedVersion: 2
      m_TileIndex: 5
      m_TileSpriteIndex: 5
      m_TileMatrixIndex: 0
      m_TileColorIndex: 0
      m_TileObjectToInstantiateIndex: 65535
      dummyAlignment: 0
      m_AllTileFlags: 1073741825
  - first: {x: 0, y: 1, z: 0}
    second:
      serializedVersion: 2
      m_TileIndex: 6
      m_TileSpriteIndex: 6
      m_TileMatrixIndex: 0
      m_TileColorIndex: 0
      m_TileObjectToInstantiateIndex: 65535
      dummyAlignment: 0
      m_AllTileFlags: 1073741825
  - first: {x: 1, y: 1, z: 0}
    second:
      serializedVersion: 2
      m_TileIndex: 7
      m_TileSpriteIndex: 7
      m_TileMatrixIndex: 0
      m_TileColorIndex: 0
      m_TileObjectToInstantiateIndex: 65535
      dummyAlignment: 0
      m_AllTileFlags: 1073741825
  - first: {x: 3, y: 1, z: 0}
    second:
      serializedVersion: 2
      m_TileIndex: 8
      m_TileSpriteIndex: 8
      m_TileMatrixIndex: 0
      m_TileColorIndex: 0
      m_TileObjectToInstantiateIndex: 65535
      dummyAlignment: 0
      m_AllTileFlags: 1073741825
  - first: {x: 4, y: 1, z: 0}
    second:
      serializedVersion: 2
      m_TileIndex: 9
      m_TileSpriteIndex: 9
      m_TileMatrixIndex: 0
      m_TileColorIndex: 0
      m_TileObjectToInstantiateIndex: 65535
      dummyAlignment: 0
      m_AllTileFlags: 1073741825
  - first: {x: -2, y: 2, z: 0}
    second:
      serializedVersion: 2
      m_TileIndex: 0
      m_TileSpriteIndex: 0
      m_TileMatrixIndex: 0
      m_TileColorIndex: 0
      m_TileObjectToInstantiateIndex: 65535
      dummyAlignment: 0
      m_AllTileFlags: 1073741825
  - first: {x: -1, y: 2, z: 0}
    second:
      serializedVersion: 2
      m_TileIndex: 1
      m_TileSpriteIndex: 1
      m_TileMatrixIndex: 0
      m_TileColorIndex: 0
      m_TileObjectToInstantiateIndex: 65535
      dummyAlignment: 0
      m_AllTileFlags: 1073741825
  - first: {x: 0, y: 2, z: 0}
    second:
      serializedVersion: 2
      m_TileIndex: 2
      m_TileSpriteIndex: 2
      m_TileMatrixIndex: 0
      m_TileColorIndex: 0
      m_TileObjectToInstantiateIndex: 65535
      dummyAlignment: 0
      m_AllTileFlags: 1073741825
  - first: {x: 1, y: 2, z: 0}
    second:
      serializedVersion: 2
      m_TileIndex: 3
      m_TileSpriteIndex: 3
      m_TileMatrixIndex: 0
      m_TileColorIndex: 0
      m_TileObjectToInstantiateIndex: 65535
      dummyAlignment: 0
      m_AllTileFlags: 1073741825
  - first: {x: 4, y: 2, z: 0}
    second:
      serializedVersion: 2
      m_TileIndex: 4
      m_TileSpriteIndex: 4
      m_TileMatrixIndex: 0
      m_TileColorIndex: 0
      m_TileObjectToInstantiateIndex: 65535
      dummyAlignment: 0
      m_AllTileFlags: 1073741825
  m_AnimatedTiles: {}
  m_TileAssetArray:
  - m_RefCount: 1
    m_Data: {fileID: 11400000, guid: 737e3314f70ef03498902ff3605e8d02, type: 2}
  - m_RefCount: 1
    m_Data: {fileID: 11400000, guid: 0c5a1d53f70e1b04fa0d958bdfcc95d9, type: 2}
  - m_RefCount: 1
    m_Data: {fileID: 11400000, guid: 188f3540b2ff4cd4c8d9a0559daf1032, type: 2}
  - m_RefCount: 1
    m_Data: {fileID: 11400000, guid: 158a579de663fc94ea9476647200db33, type: 2}
  - m_RefCount: 1
    m_Data: {fileID: 11400000, guid: 4d094b8ad8eea4746ad833ef26b3a0a8, type: 2}
  - m_RefCount: 1
    m_Data: {fileID: 11400000, guid: 7438cf3ce0c6800439aea49b18e79c4b, type: 2}
  - m_RefCount: 1
    m_Data: {fileID: 11400000, guid: 8b80334f4a68eb8478ae14d84493e47f, type: 2}
  - m_RefCount: 1
    m_Data: {fileID: 11400000, guid: edce3fd25f3f4f349b43a1338d73c532, type: 2}
  - m_RefCount: 1
    m_Data: {fileID: 11400000, guid: 781a864b07966b3428e4cc852a1ac81c, type: 2}
  - m_RefCount: 1
    m_Data: {fileID: 11400000, guid: a4edf6c206b07f14c839343e482a21cf, type: 2}
  - m_RefCount: 1
    m_Data: {fileID: 11400000, guid: eb107ae106d217c40800be10e77e6521, type: 2}
  - m_RefCount: 1
    m_Data: {fileID: 11400000, guid: b8daefc0a8945514bb23efb3879470a7, type: 2}
  - m_RefCount: 1
    m_Data: {fileID: 11400000, guid: 599a9552a82d1ad43a75a2bb4616592d, type: 2}
  - m_RefCount: 1
    m_Data: {fileID: 11400000, guid: 8c40d5efd7862c24cacd73031288724b, type: 2}
  - m_RefCount: 1
    m_Data: {fileID: 11400000, guid: 0f4f4c147cbbc64479f3ce09bab0f04f, type: 2}
  - m_RefCount: 1
    m_Data: {fileID: 11400000, guid: e2555d906d5a80648b3c74055569c6b8, type: 2}
  - m_RefCount: 1
    m_Data: {fileID: 11400000, guid: 9e7bdee2e6488784d8987c5f5a36eb80, type: 2}
  - m_RefCount: 1
    m_Data: {fileID: 11400000, guid: c36862d281f5d4b44a7eb6dc65ce6f16, type: 2}
  - m_RefCount: 1
    m_Data: {fileID: 11400000, guid: b32c50b5387341b449468a4fa1cf503b, type: 2}
  - m_RefCount: 1
    m_Data: {fileID: 11400000, guid: e08b52b35c9c13b40922f194f0407c03, type: 2}
  - m_RefCount: 1
    m_Data: {fileID: 11400000, guid: 0aaadb4e8cec3ca4fad298e9d3e6cc91, type: 2}
  - m_RefCount: 1
    m_Data: {fileID: 11400000, guid: 01f1e0d4f7cea9b4293076544d8c70ba, type: 2}
  - m_RefCount: 1
    m_Data: {fileID: 11400000, guid: 43decd341ba11ad48ac277a381ba1663, type: 2}
  - m_RefCount: 1
    m_Data: {fileID: 11400000, guid: 597e367e1e2c1be40b989a06e56c1190, type: 2}
  m_TileSpriteArray:
  - m_RefCount: 1
    m_Data: {fileID: -465412042, guid: 1b8fe129c8c9ae446a103710382eaf67, type: 3}
  - m_RefCount: 1
    m_Data: {fileID: 420399365, guid: 1b8fe129c8c9ae446a103710382eaf67, type: 3}
  - m_RefCount: 1
    m_Data: {fileID: 1414234620, guid: 1b8fe129c8c9ae446a103710382eaf67, type: 3}
  - m_RefCount: 1
    m_Data: {fileID: 1854444068, guid: 1b8fe129c8c9ae446a103710382eaf67, type: 3}
  - m_RefCount: 1
    m_Data: {fileID: -1737699749, guid: 1b8fe129c8c9ae446a103710382eaf67, type: 3}
  - m_RefCount: 1
    m_Data: {fileID: -255907446, guid: 1b8fe129c8c9ae446a103710382eaf67, type: 3}
  - m_RefCount: 1
    m_Data: {fileID: 312261287, guid: 1b8fe129c8c9ae446a103710382eaf67, type: 3}
  - m_RefCount: 1
    m_Data: {fileID: 544129709, guid: 1b8fe129c8c9ae446a103710382eaf67, type: 3}
  - m_RefCount: 1
    m_Data: {fileID: -2005480111, guid: 1b8fe129c8c9ae446a103710382eaf67, type: 3}
  - m_RefCount: 1
    m_Data: {fileID: -1138667035, guid: 1b8fe129c8c9ae446a103710382eaf67, type: 3}
  - m_RefCount: 1
    m_Data: {fileID: 1162051385, guid: 1b8fe129c8c9ae446a103710382eaf67, type: 3}
  - m_RefCount: 1
    m_Data: {fileID: 1669768145, guid: 1b8fe129c8c9ae446a103710382eaf67, type: 3}
  - m_RefCount: 1
    m_Data: {fileID: -971588636, guid: 1b8fe129c8c9ae446a103710382eaf67, type: 3}
  - m_RefCount: 1
    m_Data: {fileID: 1034817102, guid: 1b8fe129c8c9ae446a103710382eaf67, type: 3}
  - m_RefCount: 1
    m_Data: {fileID: -1218082866, guid: 1b8fe129c8c9ae446a103710382eaf67, type: 3}
  - m_RefCount: 1
    m_Data: {fileID: 1287791180, guid: 1b8fe129c8c9ae446a103710382eaf67, type: 3}
  - m_RefCount: 1
    m_Data: {fileID: 1862578812, guid: 1b8fe129c8c9ae446a103710382eaf67, type: 3}
  - m_RefCount: 1
    m_Data: {fileID: 2000228188, guid: 1b8fe129c8c9ae446a103710382eaf67, type: 3}
  - m_RefCount: 1
    m_Data: {fileID: -1203565328, guid: 1b8fe129c8c9ae446a103710382eaf67, type: 3}
  - m_RefCount: 1
    m_Data: {fileID: -325421589, guid: 1b8fe129c8c9ae446a103710382eaf67, type: 3}
  - m_RefCount: 1
    m_Data: {fileID: -850897098, guid: 1b8fe129c8c9ae446a103710382eaf67, type: 3}
  - m_RefCount: 1
    m_Data: {fileID: -1055652877, guid: 1b8fe129c8c9ae446a103710382eaf67, type: 3}
  - m_RefCount: 1
    m_Data: {fileID: -483643456, guid: 1b8fe129c8c9ae446a103710382eaf67, type: 3}
  - m_RefCount: 1
    m_Data: {fileID: -84689224, guid: 1b8fe129c8c9ae446a103710382eaf67, type: 3}
  m_TileMatrixArray:
  - m_RefCount: 24
    m_Data:
      e00: 1
      e01: 0
      e02: 0
      e03: 0
      e10: 0
      e11: 1
      e12: 0
      e13: 0
      e20: 0
      e21: 0
      e22: 1
      e23: 0
      e30: 0
      e31: 0
      e32: 0
      e33: 1
  m_TileColorArray:
  - m_RefCount: 24
    m_Data: {r: 1, g: 1, b: 1, a: 1}
  m_TileObjectToInstantiateArray: []
  m_AnimationFrameRate: 1
  m_Color: {r: 1, g: 1, b: 1, a: 1}
  m_Origin: {x: -2, y: -3, z: 0}
  m_Size: {x: 8, y: 6, z: 1}
  m_TileAnchor: {x: 0.5, y: 0.5, z: 0}
  m_TileOrientation: 0
  m_TileOrientationMatrix:
    e00: 1
    e01: 0
    e02: 0
    e03: 0
    e10: 0
    e11: 1
    e12: 0
    e13: 0
    e20: 0
    e21: 0
    e22: 1
    e23: 0
    e30: 0
    e31: 0
    e32: 0
    e33: 1
--- !u!483693784 &1387755453865362174
TilemapRenderer:
  m_ObjectHideFlags: 0
  m_CorrespondingSourceObject: {fileID: 0}
  m_PrefabInstance: {fileID: 0}
  m_PrefabAsset: {fileID: 0}
  m_GameObject: {fileID: 5117006086880631642}
  m_Enabled: 1
  m_CastShadows: 0
  m_ReceiveShadows: 0
  m_DynamicOccludee: 0
  m_StaticShadowCaster: 0
  m_MotionVectors: 1
  m_LightProbeUsage: 0
  m_ReflectionProbeUsage: 0
  m_RayTracingMode: 0
  m_RayTraceProcedural: 0
  m_RenderingLayerMask: 1
  m_RendererPriority: 0
  m_Materials:
  - {fileID: 10754, guid: 0000000000000000f000000000000000, type: 0}
  m_StaticBatchInfo:
    firstSubMesh: 0
    subMeshCount: 0
  m_StaticBatchRoot: {fileID: 0}
  m_ProbeAnchor: {fileID: 0}
  m_LightProbeVolumeOverride: {fileID: 0}
  m_ScaleInLightmap: 1
  m_ReceiveGI: 1
  m_PreserveUVs: 0
  m_IgnoreNormalsForChartDetection: 0
  m_ImportantGI: 0
  m_StitchLightmapSeams: 1
  m_SelectedEditorRenderState: 0
  m_MinimumChartSize: 4
  m_AutoUVMaxDistance: 0.5
  m_AutoUVMaxAngle: 89
  m_LightmapParameters: {fileID: 0}
  m_SortingLayerID: 0
  m_SortingLayer: 0
  m_SortingOrder: 0
  m_ChunkSize: {x: 32, y: 32, z: 32}
  m_ChunkCullingBounds: {x: 0, y: 0, z: 0}
  m_MaxChunkCount: 16
  m_MaxFrameAge: 16
  m_SortOrder: 0
  m_Mode: 0
  m_DetectChunkCullingBounds: 0
  m_MaskInteraction: 0
--- !u!114 &2828786551917706592
MonoBehaviour:
  m_ObjectHideFlags: 0
  m_CorrespondingSourceObject: {fileID: 0}
  m_PrefabInstance: {fileID: 0}
  m_PrefabAsset: {fileID: 0}
  m_GameObject: {fileID: 0}
  m_Enabled: 1
  m_EditorHideFlags: 0
  m_Script: {fileID: 12395, guid: 0000000000000000e000000000000000, type: 0}
  m_Name: Palette Settings
  m_EditorClassIdentifier: 
  cellSizing: 0
  m_TransparencySortMode: 0
  m_TransparencySortAxis: {x: 0, y: 0, z: 1}
