%YAML 1.1
%TAG !u! tag:unity3d.com,2011:
--- !u!114 &11400000
MonoBehaviour:
  m_ObjectHideFlags: 0
  m_CorrespondingSourceObject: {fileID: 0}
  m_PrefabInstance: {fileID: 0}
  m_PrefabAsset: {fileID: 0}
  m_GameObject: {fileID: 0}
  m_Enabled: 1
  m_EditorHideFlags: 0
  m_Script: {fileID: 11500000, guid: af0faa17d9dfdba438d44aaf3959e995, type: 3}
  m_Name: BartenderMustBeNew
  m_EditorClassIdentifier: 
  portrait: {fileID: 21300000, guid: 1632cd06be1c14644980b203ab903c24, type: 3}
  lines:
  - "You must be new around here. I don\u2019t know how you got here, but there\u2019s
    one thing you should know:"
  - "Alcohol is bad for you and tastes bad, too! That\u2019s why we don\u2019t serve
    it in our lovely little village."
  answers: []
  answerLeadingTo: []
  leadsTo: {fileID: 11400000, guid: 7e851c2af890d634cb601116414c9706, type: 2}
  speaker: Bartender
  actionToTrigger: {fileID: 0}
