%YAML 1.1
%TAG !u! tag:unity3d.com,2011:
--- !u!114 &11400000
MonoBehaviour:
  m_ObjectHideFlags: 0
  m_CorrespondingSourceObject: {fileID: 0}
  m_PrefabInstance: {fileID: 0}
  m_PrefabAsset: {fileID: 0}
  m_GameObject: {fileID: 0}
  m_Enabled: 1
  m_EditorHideFlags: 0
  m_Script: {fileID: 11500000, guid: af0faa17d9dfdba438d44aaf3959e995, type: 3}
  m_Name: F2
  m_EditorClassIdentifier: 
  portrait: {fileID: 21300000, guid: 0e63adcb12ec0004f8c9f9be58acf837, type: 3}
  lines:
  - Liquid bread you say?
  - '[takes a sip]'
  - Oh sweet bitter beer, how I missed you!
  - Thanks man!
  answers: []
  answerLeadingTo: []
  leadsTo: {fileID: 0}
  speaker: Farmer Hank
  actionToTrigger: {fileID: 6912844737427371598, guid: b137aec3bf343314e941a112535b7222, type: 3}
