%YAML 1.1
%TAG !u! tag:unity3d.com,2011:
--- !u!114 &11400000
MonoBehaviour:
  m_ObjectHideFlags: 0
  m_CorrespondingSourceObject: {fileID: 0}
  m_PrefabInstance: {fileID: 0}
  m_PrefabAsset: {fileID: 0}
  m_GameObject: {fileID: 0}
  m_Enabled: 1
  m_EditorHideFlags: 0
  m_Script: {fileID: 11500000, guid: af0faa17d9dfdba438d44aaf3959e995, type: 3}
  m_Name: G1
  m_EditorClassIdentifier: 
  portrait: {fileID: 21300000, guid: ed3acbabcc71ae048a71b4cca5610823, type: 3}
  lines:
  - Aren't you a kind young lad?
  - Good afternoon to you too!
  - Would you mind telling me where I live?
  - I think I forgot...
  answers: []
  answerLeadingTo: []
  leadsTo: {fileID: 11400000, guid: 8222fd5304c52174291a3f5a91b9e535, type: 2}
  speaker: Old Lady
  actionToTrigger: {fileID: 0}
