%YAML 1.1
%TAG !u! tag:unity3d.com,2011:
--- !u!114 &11400000
MonoBehaviour:
  m_ObjectHideFlags: 0
  m_CorrespondingSourceObject: {fileID: 0}
  m_PrefabInstance: {fileID: 0}
  m_PrefabAsset: {fileID: 0}
  m_GameObject: {fileID: 0}
  m_Enabled: 1
  m_EditorHideFlags: 0
  m_Script: {fileID: 11500000, guid: af0faa17d9dfdba438d44aaf3959e995, type: 3}
  m_Name: P3 - EXIT
  m_EditorClassIdentifier: 
  portrait: {fileID: 21300000, guid: a2b4c71242fb65f42b9987b897c13ab3, type: 3}
  lines:
  - I'm starting to question my choices...
  answers: []
  answerLeadingTo: []
  leadsTo: {fileID: 0}
  speaker: Protagonist
  actionToTrigger: {fileID: 6912844737427371598, guid: 5e40a4a1a86cb6e49aad42a864850b2b, type: 3}
