%YAML 1.1
%TAG !u! tag:unity3d.com,2011:
--- !u!114 &11400000
MonoBehaviour:
  m_ObjectHideFlags: 0
  m_CorrespondingSourceObject: {fileID: 0}
  m_PrefabInstance: {fileID: 0}
  m_PrefabAsset: {fileID: 0}
  m_GameObject: {fileID: 0}
  m_Enabled: 1
  m_EditorHideFlags: 0
  m_Script: {fileID: 11500000, guid: af0faa17d9dfdba438d44aaf3959e995, type: 3}
  m_Name: K1
  m_EditorClassIdentifier: 
  portrait: {fileID: 21300000, guid: 26e3855826022634e82b693132e457b3, type: 3}
  lines:
  - What is that?
  - Did you pee in the glass?
  answers: []
  answerLeadingTo: []
  leadsTo: {fileID: 11400000, guid: 4ed7dc23423955042a74bd2dc9c65be2, type: 2}
  speaker: Kiddo
  actionToTrigger: {fileID: 0}
