%YAML 1.1
%TAG !u! tag:unity3d.com,2011:
--- !u!114 &11400000
MonoBehaviour:
  m_ObjectHideFlags: 0
  m_CorrespondingSourceObject: {fileID: 0}
  m_PrefabInstance: {fileID: 0}
  m_PrefabAsset: {fileID: 0}
  m_GameObject: {fileID: 0}
  m_Enabled: 1
  m_EditorHideFlags: 0
  m_Script: {fileID: 11500000, guid: af0faa17d9dfdba438d44aaf3959e995, type: 3}
  m_Name: NotYourGuy
  m_EditorClassIdentifier: 
  portrait: {fileID: 21300000, guid: a2b4c71242fb65f42b9987b897c13ab3, type: 3}
  lines:
  - I'm not your guy, friend.
  answers:
  - I'm not your friend, pal.
  - This place seems weird. What's going on?
  answerLeadingTo:
  - {fileID: 11400000, guid: 17fb85e083a50b84db9f2093aa3d91c3, type: 2}
  - {fileID: 11400000, guid: 8394e07d6e09d0f4682433a424ac7075, type: 2}
  leadsTo: {fileID: 0}
  speaker: Buddy
  actionToTrigger: {fileID: 0}
