%YAML 1.1
%TAG !u! tag:unity3d.com,2011:
--- !u!114 &11400000
MonoBehaviour:
  m_ObjectHideFlags: 0
  m_CorrespondingSourceObject: {fileID: 0}
  m_PrefabInstance: {fileID: 0}
  m_PrefabAsset: {fileID: 0}
  m_GameObject: {fileID: 0}
  m_Enabled: 1
  m_EditorHideFlags: 0
  m_Script: {fileID: 11500000, guid: 5932a2f6562fe62468af4937673106d0, type: 3}
  m_Name: D_FIRST
  m_EditorClassIdentifier: 
  tree:
  - burnAfterReading: 1
    requirements: 0
    branch:
    - text: '!!!'
    - text: ...a human?
    - text: Allow me to introduce myself - my name is Aquid Monopole!
    - text: I was looking for investment and business opportunities here.
    - text: Not sure if you noticed, but the locals can get quite unfriendly.
    - text: Before I even knew it I ended up stuck here.
    - text: Oh no, I wonder how long I have been gone!
    - text: My assets!
    - text: My portfolio!
    - text: What if I am destitute?!
    branchEnder:
      text: This expedition might end up with me drowning in debt!
      responses:
      - What the - Are you made of water?
      - ...Portfolio? Is there a stock market in this place?
      children: 0100000001000000
  - burnAfterReading: 1
    requirements: 0
    branch:
    - text: Yes and I assure you, I am quite liquid.
    branchEnder:
      text: In any case, would you mind carrying me around to the exit?
      responses:
      - Why? Just kill yourself.
      children: 02000000
  - burnAfterReading: 1
    requirements: 0
    branch:
    - text: If I did that, I would lose all of the assets I have collected while
        down here! All the gold, the gems!
    - text: The only thing I would have is information and knowledge, and who would
        want that?
    - text: Do I look like a nerd?
    - text: ...Do not answer that.
    branchEnder:
      text: Either way, carrying me with you will benefit you!
      responses:
      - How so?
      children: 03000000
  - burnAfterReading: 1
    requirements: 0
    branch:
    - text: 'For one, I will be grateful. '
    - text: And I run a shop in the village, so my gratefulness can be quite... tangible.
    - text: And two, the Dop...
    - text: Well, I have reason to believe, that you will become more powerful, should
        you carry me around.
    - text: As you noticed, I am made of water - thus, your Water Crystal Heart will
        be more powerful as you carry me.
    branchEnder:
      text: So, just pick me up, and take me with you!
      responses: []
      children: 
