%YAML 1.1
%TAG !u! tag:unity3d.com,2011:
--- !u!1 &1384982501905266926
GameObject:
  m_ObjectHideFlags: 0
  m_CorrespondingSourceObject: {fileID: 0}
  m_PrefabInstance: {fileID: 0}
  m_PrefabAsset: {fileID: 0}
  serializedVersion: 6
  m_Component:
  - component: {fileID: 8108336768192771664}
  m_Layer: 0
  m_Name: Wall_3.4
  m_TagString: Untagged
  m_Icon: {fileID: 0}
  m_NavMeshLayer: 0
  m_StaticEditorFlags: 0
  m_IsActive: 1
--- !u!4 &8108336768192771664
Transform:
  m_ObjectHideFlags: 0
  m_CorrespondingSourceObject: {fileID: 0}
  m_PrefabInstance: {fileID: 0}
  m_PrefabAsset: {fileID: 0}
  m_GameObject: {fileID: 1384982501905266926}
  serializedVersion: 2
  m_LocalRotation: {x: 0, y: 0, z: 0, w: 1}
  m_LocalPosition: {x: 0, y: 0, z: 0}
  m_LocalScale: {x: 1, y: 1, z: 1}
  m_ConstrainProportionsScale: 0
  m_Children:
  - {fileID: 5800828866442927023}
  m_Father: {fileID: 0}
  m_LocalEulerAnglesHint: {x: 0, y: 0, z: 0}
--- !u!1001 &6271850048973503556
PrefabInstance:
  m_ObjectHideFlags: 0
  serializedVersion: 2
  m_Modification:
    serializedVersion: 3
    m_TransformParent: {fileID: 8108336768192771664}
    m_Modifications:
    - target: {fileID: -8679921383154817045, guid: 87d26ff7963f2794abbd68eb3c161bd4, type: 3}
      propertyPath: m_LocalScale.x
      value: 1.5
      objectReference: {fileID: 0}
    - target: {fileID: -8679921383154817045, guid: 87d26ff7963f2794abbd68eb3c161bd4, type: 3}
      propertyPath: m_LocalScale.y
      value: 1.5000001
      objectReference: {fileID: 0}
    - target: {fileID: -8679921383154817045, guid: 87d26ff7963f2794abbd68eb3c161bd4, type: 3}
      propertyPath: m_LocalScale.z
      value: 1.5000001
      objectReference: {fileID: 0}
    - target: {fileID: -8679921383154817045, guid: 87d26ff7963f2794abbd68eb3c161bd4, type: 3}
      propertyPath: m_LocalPosition.x
      value: 0
      objectReference: {fileID: 0}
    - target: {fileID: -8679921383154817045, guid: 87d26ff7963f2794abbd68eb3c161bd4, type: 3}
      propertyPath: m_LocalPosition.y
      value: 0
      objectReference: {fileID: 0}
    - target: {fileID: -8679921383154817045, guid: 87d26ff7963f2794abbd68eb3c161bd4, type: 3}
      propertyPath: m_LocalPosition.z
      value: 0
      objectReference: {fileID: 0}
    - target: {fileID: -8679921383154817045, guid: 87d26ff7963f2794abbd68eb3c161bd4, type: 3}
      propertyPath: m_LocalRotation.w
      value: 0.7071068
      objectReference: {fileID: 0}
    - target: {fileID: -8679921383154817045, guid: 87d26ff7963f2794abbd68eb3c161bd4, type: 3}
      propertyPath: m_LocalRotation.x
      value: -0.7071068
      objectReference: {fileID: 0}
    - target: {fileID: -8679921383154817045, guid: 87d26ff7963f2794abbd68eb3c161bd4, type: 3}
      propertyPath: m_LocalRotation.y
      value: -0
      objectReference: {fileID: 0}
    - target: {fileID: -8679921383154817045, guid: 87d26ff7963f2794abbd68eb3c161bd4, type: 3}
      propertyPath: m_LocalRotation.z
      value: -0
      objectReference: {fileID: 0}
    - target: {fileID: -8679921383154817045, guid: 87d26ff7963f2794abbd68eb3c161bd4, type: 3}
      propertyPath: m_LocalEulerAnglesHint.x
      value: -90
      objectReference: {fileID: 0}
    - target: {fileID: -8679921383154817045, guid: 87d26ff7963f2794abbd68eb3c161bd4, type: 3}
      propertyPath: m_LocalEulerAnglesHint.y
      value: 0
      objectReference: {fileID: 0}
    - target: {fileID: -8679921383154817045, guid: 87d26ff7963f2794abbd68eb3c161bd4, type: 3}
      propertyPath: m_LocalEulerAnglesHint.z
      value: 0
      objectReference: {fileID: 0}
    - target: {fileID: 919132149155446097, guid: 87d26ff7963f2794abbd68eb3c161bd4, type: 3}
      propertyPath: m_Name
      value: Dungeon_Wall_4
      objectReference: {fileID: 0}
    m_RemovedComponents: []
    m_RemovedGameObjects: []
    m_AddedGameObjects: []
    m_AddedComponents:
    - targetCorrespondingSourceObject: {fileID: 919132149155446097, guid: 87d26ff7963f2794abbd68eb3c161bd4, type: 3}
      insertIndex: -1
      addedObject: {fileID: 2669527721761436706}
    - targetCorrespondingSourceObject: {fileID: 919132149155446097, guid: 87d26ff7963f2794abbd68eb3c161bd4, type: 3}
      insertIndex: -1
      addedObject: {fileID: 6898429806607141874}
  m_SourcePrefab: {fileID: 100100000, guid: 87d26ff7963f2794abbd68eb3c161bd4, type: 3}
--- !u!4 &5800828866442927023 stripped
Transform:
  m_CorrespondingSourceObject: {fileID: -8679921383154817045, guid: 87d26ff7963f2794abbd68eb3c161bd4, type: 3}
  m_PrefabInstance: {fileID: 6271850048973503556}
  m_PrefabAsset: {fileID: 0}
--- !u!1 &6614520880902553877 stripped
GameObject:
  m_CorrespondingSourceObject: {fileID: 919132149155446097, guid: 87d26ff7963f2794abbd68eb3c161bd4, type: 3}
  m_PrefabInstance: {fileID: 6271850048973503556}
  m_PrefabAsset: {fileID: 0}
--- !u!64 &2669527721761436706
MeshCollider:
  m_ObjectHideFlags: 0
  m_CorrespondingSourceObject: {fileID: 0}
  m_PrefabInstance: {fileID: 0}
  m_PrefabAsset: {fileID: 0}
  m_GameObject: {fileID: 6614520880902553877}
  m_Material: {fileID: 0}
  m_IncludeLayers:
    serializedVersion: 2
    m_Bits: 0
  m_ExcludeLayers:
    serializedVersion: 2
    m_Bits: 0
  m_LayerOverridePriority: 0
  m_IsTrigger: 0
  m_ProvidesContacts: 0
  m_Enabled: 1
  serializedVersion: 5
  m_Convex: 0
  m_CookingOptions: 30
  m_Mesh: {fileID: 4485471208414624260, guid: 87d26ff7963f2794abbd68eb3c161bd4, type: 3}
--- !u!65 &6898429806607141874
BoxCollider:
  m_ObjectHideFlags: 0
  m_CorrespondingSourceObject: {fileID: 0}
  m_PrefabInstance: {fileID: 0}
  m_PrefabAsset: {fileID: 0}
  m_GameObject: {fileID: 6614520880902553877}
  m_Material: {fileID: 0}
  m_IncludeLayers:
    serializedVersion: 2
    m_Bits: 0
  m_ExcludeLayers:
    serializedVersion: 2
    m_Bits: 0
  m_LayerOverridePriority: 0
  m_IsTrigger: 0
  m_ProvidesContacts: 0
  m_Enabled: 1
  serializedVersion: 3
  m_Size: {x: 1.8939135, y: 1.9999998, z: 1}
  m_Center: {x: -0.053043246, y: -0.0000019073484, z: 3.5}
