%YAML 1.1
%TAG !u! tag:unity3d.com,2011:
--- !u!1 &2661197024294495786
GameObject:
  m_ObjectHideFlags: 0
  m_CorrespondingSourceObject: {fileID: 0}
  m_PrefabInstance: {fileID: 0}
  m_PrefabAsset: {fileID: 0}
  serializedVersion: 6
  m_Component:
  - component: {fileID: 3433335234728705168}
  - component: {fileID: 1732324145541755701}
  - component: {fileID: 4606765601766623231}
  m_Layer: 0
  m_Name: bear-riders2
  m_TagString: Untagged
  m_Icon: {fileID: 0}
  m_NavMeshLayer: 0
  m_StaticEditorFlags: 0
  m_IsActive: 1
--- !u!4 &3433335234728705168
Transform:
  m_ObjectHideFlags: 0
  m_CorrespondingSourceObject: {fileID: 0}
  m_PrefabInstance: {fileID: 0}
  m_PrefabAsset: {fileID: 0}
  m_GameObject: {fileID: 2661197024294495786}
  serializedVersion: 2
  m_LocalRotation: {x: -0.0045732176, y: -0.019791463, z: -0.116925634, w: 0.9929329}
  m_LocalPosition: {x: 19.819809, y: 3.4, z: 5.809234}
  m_LocalScale: {x: -2.6653638, y: -2.6653638, z: -149.03983}
  m_ConstrainProportionsScale: 0
  m_Children: []
  m_Father: {fileID: 0}
  m_LocalEulerAnglesHint: {x: 0, y: 0, z: 0}
--- !u!33 &1732324145541755701
MeshFilter:
  m_ObjectHideFlags: 0
  m_CorrespondingSourceObject: {fileID: 0}
  m_PrefabInstance: {fileID: 0}
  m_PrefabAsset: {fileID: 0}
  m_GameObject: {fileID: 2661197024294495786}
  m_Mesh: {fileID: 2534964839176971238, guid: ff0522cb821a37b4b826418788b621b9, type: 3}
--- !u!23 &4606765601766623231
MeshRenderer:
  m_ObjectHideFlags: 0
  m_CorrespondingSourceObject: {fileID: 0}
  m_PrefabInstance: {fileID: 0}
  m_PrefabAsset: {fileID: 0}
  m_GameObject: {fileID: 2661197024294495786}
  m_Enabled: 1
  m_CastShadows: 1
  m_ReceiveShadows: 1
  m_DynamicOccludee: 1
  m_StaticShadowCaster: 0
  m_MotionVectors: 1
  m_LightProbeUsage: 1
  m_ReflectionProbeUsage: 1
  m_RayTracingMode: 2
  m_RayTraceProcedural: 0
  m_RenderingLayerMask: 1
  m_RendererPriority: 0
  m_Materials:
  - {fileID: -6922793697723135513, guid: ff0522cb821a37b4b826418788b621b9, type: 3}
  - {fileID: -6478536213147159724, guid: ff0522cb821a37b4b826418788b621b9, type: 3}
  - {fileID: -6478536213147159724, guid: ff0522cb821a37b4b826418788b621b9, type: 3}
  - {fileID: 4874126678125670354, guid: ff0522cb821a37b4b826418788b621b9, type: 3}
  - {fileID: -5262865513972871456, guid: ff0522cb821a37b4b826418788b621b9, type: 3}
  - {fileID: -5262865513972871456, guid: ff0522cb821a37b4b826418788b621b9, type: 3}
  m_StaticBatchInfo:
    firstSubMesh: 0
    subMeshCount: 0
  m_StaticBatchRoot: {fileID: 0}
  m_ProbeAnchor: {fileID: 0}
  m_LightProbeVolumeOverride: {fileID: 0}
  m_ScaleInLightmap: 1
  m_ReceiveGI: 1
  m_PreserveUVs: 0
  m_IgnoreNormalsForChartDetection: 0
  m_ImportantGI: 0
  m_StitchLightmapSeams: 1
  m_SelectedEditorRenderState: 3
  m_MinimumChartSize: 4
  m_AutoUVMaxDistance: 0.5
  m_AutoUVMaxAngle: 89
  m_LightmapParameters: {fileID: 0}
  m_SortingLayerID: 0
  m_SortingLayer: 0
  m_SortingOrder: 0
  m_AdditionalVertexStreams: {fileID: 0}
