%YAML 1.1
%TAG !u! tag:unity3d.com,2011:
--- !u!1001 &4989603300204657185
PrefabInstance:
  m_ObjectHideFlags: 0
  serializedVersion: 2
  m_Modification:
    serializedVersion: 3
    m_TransformParent: {fileID: 0}
    m_Modifications:
    - target: {fileID: -8679921383154817045, guid: a164fbeefc531964ba4b47975ffb2dba, type: 3}
      propertyPath: m_LocalPosition.x
      value: 24.036634
      objectReference: {fileID: 0}
    - target: {fileID: -8679921383154817045, guid: a164fbeefc531964ba4b47975ffb2dba, type: 3}
      propertyPath: m_LocalPosition.y
      value: 0
      objectReference: {fileID: 0}
    - target: {fileID: -8679921383154817045, guid: a164fbeefc531964ba4b47975ffb2dba, type: 3}
      propertyPath: m_LocalPosition.z
      value: 8.090904
      objectReference: {fileID: 0}
    - target: {fileID: -8679921383154817045, guid: a164fbeefc531964ba4b47975ffb2dba, type: 3}
      propertyPath: m_LocalRotation.w
      value: 0.7071067
      objectReference: {fileID: 0}
    - target: {fileID: -8679921383154817045, guid: a164fbeefc531964ba4b47975ffb2dba, type: 3}
      propertyPath: m_LocalRotation.x
      value: -0.7071068
      objectReference: {fileID: 0}
    - target: {fileID: -8679921383154817045, guid: a164fbeefc531964ba4b47975ffb2dba, type: 3}
      propertyPath: m_LocalRotation.y
      value: 0
      objectReference: {fileID: 0}
    - target: {fileID: -8679921383154817045, guid: a164fbeefc531964ba4b47975ffb2dba, type: 3}
      propertyPath: m_LocalRotation.z
      value: -0
      objectReference: {fileID: 0}
    - target: {fileID: -8679921383154817045, guid: a164fbeefc531964ba4b47975ffb2dba, type: 3}
      propertyPath: m_LocalEulerAnglesHint.x
      value: 0
      objectReference: {fileID: 0}
    - target: {fileID: -8679921383154817045, guid: a164fbeefc531964ba4b47975ffb2dba, type: 3}
      propertyPath: m_LocalEulerAnglesHint.y
      value: 0
      objectReference: {fileID: 0}
    - target: {fileID: -8679921383154817045, guid: a164fbeefc531964ba4b47975ffb2dba, type: 3}
      propertyPath: m_LocalEulerAnglesHint.z
      value: 0
      objectReference: {fileID: 0}
    - target: {fileID: 919132149155446097, guid: a164fbeefc531964ba4b47975ffb2dba, type: 3}
      propertyPath: m_Name
      value: Tomb_Roof_Debris_1
      objectReference: {fileID: 0}
    m_RemovedComponents: []
    m_RemovedGameObjects: []
    m_AddedGameObjects: []
    m_AddedComponents:
    - targetCorrespondingSourceObject: {fileID: 919132149155446097, guid: a164fbeefc531964ba4b47975ffb2dba, type: 3}
      insertIndex: -1
      addedObject: {fileID: 5837505802793958394}
  m_SourcePrefab: {fileID: 100100000, guid: a164fbeefc531964ba4b47975ffb2dba, type: 3}
--- !u!1 &5332200463781431152 stripped
GameObject:
  m_CorrespondingSourceObject: {fileID: 919132149155446097, guid: a164fbeefc531964ba4b47975ffb2dba, type: 3}
  m_PrefabInstance: {fileID: 4989603300204657185}
  m_PrefabAsset: {fileID: 0}
--- !u!65 &5837505802793958394
BoxCollider:
  m_ObjectHideFlags: 0
  m_CorrespondingSourceObject: {fileID: 0}
  m_PrefabInstance: {fileID: 0}
  m_PrefabAsset: {fileID: 0}
  m_GameObject: {fileID: 5332200463781431152}
  m_Material: {fileID: 0}
  m_IncludeLayers:
    serializedVersion: 2
    m_Bits: 0
  m_ExcludeLayers:
    serializedVersion: 2
    m_Bits: 0
  m_LayerOverridePriority: 0
  m_IsTrigger: 0
  m_ProvidesContacts: 0
  m_Enabled: 1
  serializedVersion: 3
  m_Size: {x: 1.3361301, y: 1.0034999, z: 0.2908566}
  m_Center: {x: 0.048464775, y: -0.061595146, z: 0.06812532}
