%YAML 1.1
%TAG !u! tag:unity3d.com,2011:
--- !u!1001 &7405922703043584605
PrefabInstance:
  m_ObjectHideFlags: 0
  serializedVersion: 2
  m_Modification:
    serializedVersion: 3
    m_TransformParent: {fileID: 0}
    m_Modifications:
    - target: {fileID: -8679921383154817045, guid: e7a5e4c03ac084649a474272b0def575, type: 3}
      propertyPath: m_LocalPosition.x
      value: 31.394674
      objectReference: {fileID: 0}
    - target: {fileID: -8679921383154817045, guid: e7a5e4c03ac084649a474272b0def575, type: 3}
      propertyPath: m_LocalPosition.y
      value: 0
      objectReference: {fileID: 0}
    - target: {fileID: -8679921383154817045, guid: e7a5e4c03ac084649a474272b0def575, type: 3}
      propertyPath: m_LocalPosition.z
      value: -16.744015
      objectReference: {fileID: 0}
    - target: {fileID: -8679921383154817045, guid: e7a5e4c03ac084649a474272b0def575, type: 3}
      propertyPath: m_LocalRotation.w
      value: 0.7071067
      objectReference: {fileID: 0}
    - target: {fileID: -8679921383154817045, guid: e7a5e4c03ac084649a474272b0def575, type: 3}
      propertyPath: m_LocalRotation.x
      value: -0.7071068
      objectReference: {fileID: 0}
    - target: {fileID: -8679921383154817045, guid: e7a5e4c03ac084649a474272b0def575, type: 3}
      propertyPath: m_LocalRotation.y
      value: 0
      objectReference: {fileID: 0}
    - target: {fileID: -8679921383154817045, guid: e7a5e4c03ac084649a474272b0def575, type: 3}
      propertyPath: m_LocalRotation.z
      value: -0
      objectReference: {fileID: 0}
    - target: {fileID: -8679921383154817045, guid: e7a5e4c03ac084649a474272b0def575, type: 3}
      propertyPath: m_LocalEulerAnglesHint.x
      value: 0
      objectReference: {fileID: 0}
    - target: {fileID: -8679921383154817045, guid: e7a5e4c03ac084649a474272b0def575, type: 3}
      propertyPath: m_LocalEulerAnglesHint.y
      value: 0
      objectReference: {fileID: 0}
    - target: {fileID: -8679921383154817045, guid: e7a5e4c03ac084649a474272b0def575, type: 3}
      propertyPath: m_LocalEulerAnglesHint.z
      value: 0
      objectReference: {fileID: 0}
    - target: {fileID: 919132149155446097, guid: e7a5e4c03ac084649a474272b0def575, type: 3}
      propertyPath: m_Name
      value: Rock_3
      objectReference: {fileID: 0}
    m_RemovedComponents: []
    m_RemovedGameObjects: []
    m_AddedGameObjects: []
    m_AddedComponents:
    - targetCorrespondingSourceObject: {fileID: 919132149155446097, guid: e7a5e4c03ac084649a474272b0def575, type: 3}
      insertIndex: -1
      addedObject: {fileID: 1768271036355111294}
  m_SourcePrefab: {fileID: 100100000, guid: e7a5e4c03ac084649a474272b0def575, type: 3}
--- !u!1 &7639924265313427212 stripped
GameObject:
  m_CorrespondingSourceObject: {fileID: 919132149155446097, guid: e7a5e4c03ac084649a474272b0def575, type: 3}
  m_PrefabInstance: {fileID: 7405922703043584605}
  m_PrefabAsset: {fileID: 0}
--- !u!65 &1768271036355111294
BoxCollider:
  m_ObjectHideFlags: 0
  m_CorrespondingSourceObject: {fileID: 0}
  m_PrefabInstance: {fileID: 0}
  m_PrefabAsset: {fileID: 0}
  m_GameObject: {fileID: 7639924265313427212}
  m_Material: {fileID: 0}
  m_IncludeLayers:
    serializedVersion: 2
    m_Bits: 0
  m_ExcludeLayers:
    serializedVersion: 2
    m_Bits: 0
  m_LayerOverridePriority: 0
  m_IsTrigger: 0
  m_ProvidesContacts: 0
  m_Enabled: 1
  serializedVersion: 3
  m_Size: {x: 3.421709, y: 3.2950058, z: 3.4734545}
  m_Center: {x: -0.0045957565, y: -0.07033122, z: 1.2946887}
