%YAML 1.1
%TAG !u! tag:unity3d.com,2011:
--- !u!1001 &3938387612685889057
PrefabInstance:
  m_ObjectHideFlags: 0
  serializedVersion: 2
  m_Modification:
    serializedVersion: 3
    m_TransformParent: {fileID: 0}
    m_Modifications:
    - target: {fileID: -8679921383154817045, guid: 177eaa9d0365a0340bf0cc0490dc6b84, type: 3}
      propertyPath: m_LocalPosition.x
      value: -4.9815283
      objectReference: {fileID: 0}
    - target: {fileID: -8679921383154817045, guid: 177eaa9d0365a0340bf0cc0490dc6b84, type: 3}
      propertyPath: m_LocalPosition.y
      value: 1.0212898
      objectReference: {fileID: 0}
    - target: {fileID: -8679921383154817045, guid: 177eaa9d0365a0340bf0cc0490dc6b84, type: 3}
      propertyPath: m_LocalPosition.z
      value: 9.359994
      objectReference: {fileID: 0}
    - target: {fileID: -8679921383154817045, guid: 177eaa9d0365a0340bf0cc0490dc6b84, type: 3}
      propertyPath: m_LocalRotation.w
      value: 0.7071067
      objectReference: {fileID: 0}
    - target: {fileID: -8679921383154817045, guid: 177eaa9d0365a0340bf0cc0490dc6b84, type: 3}
      propertyPath: m_LocalRotation.x
      value: -0.7071068
      objectReference: {fileID: 0}
    - target: {fileID: -8679921383154817045, guid: 177eaa9d0365a0340bf0cc0490dc6b84, type: 3}
      propertyPath: m_LocalRotation.y
      value: 0
      objectReference: {fileID: 0}
    - target: {fileID: -8679921383154817045, guid: 177eaa9d0365a0340bf0cc0490dc6b84, type: 3}
      propertyPath: m_LocalRotation.z
      value: -0
      objectReference: {fileID: 0}
    - target: {fileID: -8679921383154817045, guid: 177eaa9d0365a0340bf0cc0490dc6b84, type: 3}
      propertyPath: m_LocalEulerAnglesHint.x
      value: 0
      objectReference: {fileID: 0}
    - target: {fileID: -8679921383154817045, guid: 177eaa9d0365a0340bf0cc0490dc6b84, type: 3}
      propertyPath: m_LocalEulerAnglesHint.y
      value: 0
      objectReference: {fileID: 0}
    - target: {fileID: -8679921383154817045, guid: 177eaa9d0365a0340bf0cc0490dc6b84, type: 3}
      propertyPath: m_LocalEulerAnglesHint.z
      value: 0
      objectReference: {fileID: 0}
    - target: {fileID: 919132149155446097, guid: 177eaa9d0365a0340bf0cc0490dc6b84, type: 3}
      propertyPath: m_Name
      value: Door_2
      objectReference: {fileID: 0}
    m_RemovedComponents: []
    m_RemovedGameObjects: []
    m_AddedGameObjects: []
    m_AddedComponents:
    - targetCorrespondingSourceObject: {fileID: 919132149155446097, guid: 177eaa9d0365a0340bf0cc0490dc6b84, type: 3}
      insertIndex: -1
      addedObject: {fileID: 6706066650472238410}
  m_SourcePrefab: {fileID: 100100000, guid: 177eaa9d0365a0340bf0cc0490dc6b84, type: 3}
--- !u!1 &4208226253359928176 stripped
GameObject:
  m_CorrespondingSourceObject: {fileID: 919132149155446097, guid: 177eaa9d0365a0340bf0cc0490dc6b84, type: 3}
  m_PrefabInstance: {fileID: 3938387612685889057}
  m_PrefabAsset: {fileID: 0}
--- !u!65 &6706066650472238410
BoxCollider:
  m_ObjectHideFlags: 0
  m_CorrespondingSourceObject: {fileID: 0}
  m_PrefabInstance: {fileID: 0}
  m_PrefabAsset: {fileID: 0}
  m_GameObject: {fileID: 4208226253359928176}
  m_Material: {fileID: 0}
  m_IncludeLayers:
    serializedVersion: 2
    m_Bits: 0
  m_ExcludeLayers:
    serializedVersion: 2
    m_Bits: 0
  m_LayerOverridePriority: 0
  m_IsTrigger: 0
  m_ProvidesContacts: 0
  m_Enabled: 1
  serializedVersion: 3
  m_Size: {x: 1.107273, y: 0.0841778, z: 1.7306716}
  m_Center: {x: 0.53160435, y: 0.017683027, z: 0.86533684}
