%YAML 1.1
%TAG !u! tag:unity3d.com,2011:
--- !u!1001 &66033373272995045
PrefabInstance:
  m_ObjectHideFlags: 0
  serializedVersion: 2
  m_Modification:
    serializedVersion: 3
    m_TransformParent: {fileID: 0}
    m_Modifications:
    - target: {fileID: -8679921383154817045, guid: 4f3a26333dde3b749b23a7f055cb57d2, type: 3}
      propertyPath: m_LocalPosition.x
      value: 31.254814
      objectReference: {fileID: 0}
    - target: {fileID: -8679921383154817045, guid: 4f3a26333dde3b749b23a7f055cb57d2, type: 3}
      propertyPath: m_LocalPosition.y
      value: 0
      objectReference: {fileID: 0}
    - target: {fileID: -8679921383154817045, guid: 4f3a26333dde3b749b23a7f055cb57d2, type: 3}
      propertyPath: m_LocalPosition.z
      value: -17.663
      objectReference: {fileID: 0}
    - target: {fileID: -8679921383154817045, guid: 4f3a26333dde3b749b23a7f055cb57d2, type: 3}
      propertyPath: m_LocalRotation.w
      value: 0.7071067
      objectReference: {fileID: 0}
    - target: {fileID: -8679921383154817045, guid: 4f3a26333dde3b749b23a7f055cb57d2, type: 3}
      propertyPath: m_LocalRotation.x
      value: -0.7071068
      objectReference: {fileID: 0}
    - target: {fileID: -8679921383154817045, guid: 4f3a26333dde3b749b23a7f055cb57d2, type: 3}
      propertyPath: m_LocalRotation.y
      value: 0
      objectReference: {fileID: 0}
    - target: {fileID: -8679921383154817045, guid: 4f3a26333dde3b749b23a7f055cb57d2, type: 3}
      propertyPath: m_LocalRotation.z
      value: -0
      objectReference: {fileID: 0}
    - target: {fileID: -8679921383154817045, guid: 4f3a26333dde3b749b23a7f055cb57d2, type: 3}
      propertyPath: m_LocalEulerAnglesHint.x
      value: 0
      objectReference: {fileID: 0}
    - target: {fileID: -8679921383154817045, guid: 4f3a26333dde3b749b23a7f055cb57d2, type: 3}
      propertyPath: m_LocalEulerAnglesHint.y
      value: 0
      objectReference: {fileID: 0}
    - target: {fileID: -8679921383154817045, guid: 4f3a26333dde3b749b23a7f055cb57d2, type: 3}
      propertyPath: m_LocalEulerAnglesHint.z
      value: 0
      objectReference: {fileID: 0}
    - target: {fileID: 919132149155446097, guid: 4f3a26333dde3b749b23a7f055cb57d2, type: 3}
      propertyPath: m_Name
      value: Grass_Single
      objectReference: {fileID: 0}
    m_RemovedComponents: []
    m_RemovedGameObjects: []
    m_AddedGameObjects: []
    m_AddedComponents: []
  m_SourcePrefab: {fileID: 100100000, guid: 4f3a26333dde3b749b23a7f055cb57d2, type: 3}
