%YAML 1.1
%TAG !u! tag:unity3d.com,2011:
--- !u!21 &-2586649305751461242
Material:
  serializedVersion: 8
  m_ObjectHideFlags: 1
  m_CorrespondingSourceObject: {fileID: 0}
  m_PrefabInstance: {fileID: 0}
  m_PrefabAsset: {fileID: 0}
  m_Name: TextMeshPro/Sprite
  m_Shader: {fileID: 4800000, guid: cf81c85f95fe47e1a27f6ae460cf182c, type: 3}
  m_Parent: {fileID: 0}
  m_ModifiedSerializedProperties: 0
  m_ValidKeywords: []
  m_InvalidKeywords: []
  m_LightmapFlags: 4
  m_EnableInstancingVariants: 0
  m_DoubleSidedGI: 0
  m_CustomRenderQueue: -1
  stringTagMap: {}
  disabledShaderPasses: []
  m_LockedProperties: 
  m_SavedProperties:
    serializedVersion: 3
    m_TexEnvs:
    - _MainTex:
        m_Texture: {fileID: 2800000, guid: 27a021e3ddaddd34cb03bf42b3202346, type: 3}
        m_Scale: {x: 1, y: 1}
        m_Offset: {x: 0, y: 0}
    m_Ints: []
    m_Floats:
    - _ColorMask: 15
    - _CullMode: 0
    - _Stencil: 0
    - _StencilComp: 8
    - _StencilOp: 0
    - _StencilReadMask: 255
    - _StencilWriteMask: 255
    - _UseUIAlphaClip: 0
    m_Colors:
    - _ClipRect: {r: -32767, g: -32767, b: 32767, a: 32767}
    - _Color: {r: 1, g: 1, b: 1, a: 1}
  m_BuildTextureStacks: []
--- !u!114 &11400000
MonoBehaviour:
  m_ObjectHideFlags: 0
  m_CorrespondingSourceObject: {fileID: 0}
  m_PrefabInstance: {fileID: 0}
  m_PrefabAsset: {fileID: 0}
  m_GameObject: {fileID: 0}
  m_Enabled: 1
  m_EditorHideFlags: 0
  m_Script: {fileID: 11500000, guid: 84a92b25f83d49b9bc132d206b370281, type: 3}
  m_Name: CTRL_anim_HOLD
  m_EditorClassIdentifier: 
  hashCode: 77448941
  material: {fileID: -2586649305751461242}
  materialHashCode: 0
  m_Version: 1.1.0
  m_FaceInfo:
    m_FaceIndex: 0
    m_FamilyName: 
    m_StyleName: 
    m_PointSize: 0
    m_Scale: 0
    m_UnitsPerEM: 0
    m_LineHeight: 0
    m_AscentLine: 0
    m_CapLine: 0
    m_MeanLine: 0
    m_Baseline: 0
    m_DescentLine: 0
    m_SuperscriptOffset: 0
    m_SuperscriptSize: 0
    m_SubscriptOffset: 0
    m_SubscriptSize: 0
    m_UnderlineOffset: 0
    m_UnderlineThickness: 0
    m_StrikethroughOffset: 0
    m_StrikethroughThickness: 0
    m_TabWidth: 0
  spriteSheet: {fileID: 2800000, guid: 27a021e3ddaddd34cb03bf42b3202346, type: 3}
  m_SpriteCharacterTable:
  - m_ElementType: 2
    m_Unicode: 65534
    m_GlyphIndex: 0
    m_Scale: 1
    m_Name: CTRL_anim_HOLD_0
    m_HashCode: -1557446878
  - m_ElementType: 2
    m_Unicode: 65534
    m_GlyphIndex: 1
    m_Scale: 1
    m_Name: CTRL_anim_HOLD_1
    m_HashCode: -1557446877
  - m_ElementType: 2
    m_Unicode: 65534
    m_GlyphIndex: 2
    m_Scale: 1
    m_Name: CTRL_anim_HOLD_2
    m_HashCode: -1557446880
  - m_ElementType: 2
    m_Unicode: 65534
    m_GlyphIndex: 3
    m_Scale: 1
    m_Name: CTRL_anim_HOLD_3
    m_HashCode: -1557446879
  - m_ElementType: 2
    m_Unicode: 65534
    m_GlyphIndex: 4
    m_Scale: 1
    m_Name: CTRL_anim_HOLD_4
    m_HashCode: -1557446874
  - m_ElementType: 2
    m_Unicode: 65534
    m_GlyphIndex: 5
    m_Scale: 1
    m_Name: CTRL_anim_HOLD_5
    m_HashCode: -1557446873
  - m_ElementType: 2
    m_Unicode: 65534
    m_GlyphIndex: 6
    m_Scale: 1
    m_Name: CTRL_anim_HOLD_6
    m_HashCode: -1557446876
  - m_ElementType: 2
    m_Unicode: 65534
    m_GlyphIndex: 7
    m_Scale: 1
    m_Name: CTRL_anim_HOLD_7
    m_HashCode: -1557446875
  - m_ElementType: 2
    m_Unicode: 65534
    m_GlyphIndex: 8
    m_Scale: 1
    m_Name: CTRL_anim_HOLD_8
    m_HashCode: -1557446870
  - m_ElementType: 2
    m_Unicode: 65534
    m_GlyphIndex: 9
    m_Scale: 1
    m_Name: CTRL_anim_HOLD_9
    m_HashCode: -1557446869
  - m_ElementType: 2
    m_Unicode: 65534
    m_GlyphIndex: 10
    m_Scale: 1
    m_Name: CTRL_anim_HOLD_10
    m_HashCode: 143860659
  - m_ElementType: 2
    m_Unicode: 65534
    m_GlyphIndex: 11
    m_Scale: 1
    m_Name: CTRL_anim_HOLD_11
    m_HashCode: 143860658
  - m_ElementType: 2
    m_Unicode: 65534
    m_GlyphIndex: 12
    m_Scale: 1
    m_Name: CTRL_anim_HOLD_12
    m_HashCode: 143860657
  - m_ElementType: 2
    m_Unicode: 65534
    m_GlyphIndex: 13
    m_Scale: 1
    m_Name: CTRL_anim_HOLD_13
    m_HashCode: 143860656
  - m_ElementType: 2
    m_Unicode: 65534
    m_GlyphIndex: 14
    m_Scale: 1
    m_Name: CTRL_anim_HOLD_14
    m_HashCode: 143860663
  - m_ElementType: 2
    m_Unicode: 65534
    m_GlyphIndex: 15
    m_Scale: 1
    m_Name: CTRL_anim_HOLD_15
    m_HashCode: 143860662
  - m_ElementType: 2
    m_Unicode: 65534
    m_GlyphIndex: 16
    m_Scale: 1
    m_Name: CTRL_anim_HOLD_16
    m_HashCode: 143860661
  - m_ElementType: 2
    m_Unicode: 65534
    m_GlyphIndex: 17
    m_Scale: 1
    m_Name: CTRL_anim_HOLD_17
    m_HashCode: 143860660
  - m_ElementType: 2
    m_Unicode: 65534
    m_GlyphIndex: 18
    m_Scale: 1
    m_Name: CTRL_anim_HOLD_18
    m_HashCode: 143860667
  - m_ElementType: 2
    m_Unicode: 65534
    m_GlyphIndex: 19
    m_Scale: 1
    m_Name: CTRL_anim_HOLD_19
    m_HashCode: 143860666
  - m_ElementType: 2
    m_Unicode: 65534
    m_GlyphIndex: 20
    m_Scale: 1
    m_Name: CTRL_anim_HOLD_20
    m_HashCode: 143860496
  - m_ElementType: 2
    m_Unicode: 65534
    m_GlyphIndex: 21
    m_Scale: 1
    m_Name: CTRL_anim_HOLD_21
    m_HashCode: 143860497
  - m_ElementType: 2
    m_Unicode: 65534
    m_GlyphIndex: 22
    m_Scale: 1
    m_Name: CTRL_anim_HOLD_22
    m_HashCode: 143860498
  - m_ElementType: 2
    m_Unicode: 65534
    m_GlyphIndex: 23
    m_Scale: 1
    m_Name: CTRL_anim_HOLD_23
    m_HashCode: 143860499
  - m_ElementType: 2
    m_Unicode: 65534
    m_GlyphIndex: 24
    m_Scale: 1
    m_Name: CTRL_anim_HOLD_24
    m_HashCode: 143860500
  - m_ElementType: 2
    m_Unicode: 65534
    m_GlyphIndex: 25
    m_Scale: 1
    m_Name: CTRL_anim_HOLD_25
    m_HashCode: 143860501
  - m_ElementType: 2
    m_Unicode: 65534
    m_GlyphIndex: 26
    m_Scale: 1
    m_Name: CTRL_anim_HOLD_26
    m_HashCode: 143860502
  - m_ElementType: 2
    m_Unicode: 65534
    m_GlyphIndex: 27
    m_Scale: 1
    m_Name: CTRL_anim_HOLD_27
    m_HashCode: 143860503
  - m_ElementType: 2
    m_Unicode: 65534
    m_GlyphIndex: 28
    m_Scale: 1
    m_Name: CTRL_anim_HOLD_28
    m_HashCode: 143860504
  - m_ElementType: 2
    m_Unicode: 65534
    m_GlyphIndex: 29
    m_Scale: 1
    m_Name: CTRL_anim_HOLD_29
    m_HashCode: 143860505
  - m_ElementType: 2
    m_Unicode: 65534
    m_GlyphIndex: 30
    m_Scale: 1
    m_Name: CTRL_anim_HOLD_30
    m_HashCode: 143860593
  - m_ElementType: 2
    m_Unicode: 65534
    m_GlyphIndex: 31
    m_Scale: 1
    m_Name: CTRL_anim_HOLD_31
    m_HashCode: 143860592
  - m_ElementType: 2
    m_Unicode: 65534
    m_GlyphIndex: 32
    m_Scale: 1
    m_Name: CTRL_anim_HOLD_32
    m_HashCode: 143860595
  - m_ElementType: 2
    m_Unicode: 65534
    m_GlyphIndex: 33
    m_Scale: 1
    m_Name: CTRL_anim_HOLD_33
    m_HashCode: 143860594
  - m_ElementType: 2
    m_Unicode: 65534
    m_GlyphIndex: 34
    m_Scale: 1
    m_Name: CTRL_anim_HOLD_34
    m_HashCode: 143860597
  - m_ElementType: 2
    m_Unicode: 65534
    m_GlyphIndex: 35
    m_Scale: 1
    m_Name: CTRL_anim_HOLD_35
    m_HashCode: 143860596
  - m_ElementType: 2
    m_Unicode: 65534
    m_GlyphIndex: 36
    m_Scale: 1
    m_Name: CTRL_anim_HOLD_36
    m_HashCode: 143860599
  - m_ElementType: 2
    m_Unicode: 65534
    m_GlyphIndex: 37
    m_Scale: 1
    m_Name: CTRL_anim_HOLD_37
    m_HashCode: 143860598
  - m_ElementType: 2
    m_Unicode: 65534
    m_GlyphIndex: 38
    m_Scale: 1
    m_Name: CTRL_anim_HOLD_38
    m_HashCode: 143860601
  - m_ElementType: 2
    m_Unicode: 65534
    m_GlyphIndex: 39
    m_Scale: 1
    m_Name: CTRL_anim_HOLD_39
    m_HashCode: 143860600
  - m_ElementType: 2
    m_Unicode: 65534
    m_GlyphIndex: 40
    m_Scale: 1
    m_Name: CTRL_anim_HOLD_40
    m_HashCode: 143860694
  - m_ElementType: 2
    m_Unicode: 65534
    m_GlyphIndex: 41
    m_Scale: 1
    m_Name: CTRL_anim_HOLD_41
    m_HashCode: 143860695
  - m_ElementType: 2
    m_Unicode: 65534
    m_GlyphIndex: 42
    m_Scale: 1
    m_Name: CTRL_anim_HOLD_42
    m_HashCode: 143860692
  - m_ElementType: 2
    m_Unicode: 65534
    m_GlyphIndex: 43
    m_Scale: 1
    m_Name: CTRL_anim_HOLD_43
    m_HashCode: 143860693
  - m_ElementType: 2
    m_Unicode: 65534
    m_GlyphIndex: 44
    m_Scale: 1
    m_Name: CTRL_anim_HOLD_44
    m_HashCode: 143860690
  - m_ElementType: 2
    m_Unicode: 65534
    m_GlyphIndex: 45
    m_Scale: 1
    m_Name: CTRL_anim_HOLD_45
    m_HashCode: 143860691
  - m_ElementType: 2
    m_Unicode: 65534
    m_GlyphIndex: 46
    m_Scale: 1
    m_Name: CTRL_anim_HOLD_46
    m_HashCode: 143860688
  - m_ElementType: 2
    m_Unicode: 65534
    m_GlyphIndex: 47
    m_Scale: 1
    m_Name: CTRL_anim_HOLD_47
    m_HashCode: 143860689
  - m_ElementType: 2
    m_Unicode: 65534
    m_GlyphIndex: 48
    m_Scale: 1
    m_Name: CTRL_anim_HOLD_48
    m_HashCode: 143860702
  - m_ElementType: 2
    m_Unicode: 65534
    m_GlyphIndex: 49
    m_Scale: 1
    m_Name: CTRL_anim_HOLD_49
    m_HashCode: 143860703
  - m_ElementType: 2
    m_Unicode: 65534
    m_GlyphIndex: 50
    m_Scale: 1
    m_Name: CTRL_anim_HOLD_50
    m_HashCode: 143860791
  - m_ElementType: 2
    m_Unicode: 65534
    m_GlyphIndex: 51
    m_Scale: 1
    m_Name: CTRL_anim_HOLD_51
    m_HashCode: 143860790
  - m_ElementType: 2
    m_Unicode: 65534
    m_GlyphIndex: 52
    m_Scale: 1
    m_Name: CTRL_anim_HOLD_52
    m_HashCode: 143860789
  - m_ElementType: 2
    m_Unicode: 65534
    m_GlyphIndex: 53
    m_Scale: 1
    m_Name: CTRL_anim_HOLD_53
    m_HashCode: 143860788
  - m_ElementType: 2
    m_Unicode: 65534
    m_GlyphIndex: 54
    m_Scale: 1
    m_Name: CTRL_anim_HOLD_54
    m_HashCode: 143860787
  - m_ElementType: 2
    m_Unicode: 65534
    m_GlyphIndex: 55
    m_Scale: 1
    m_Name: CTRL_anim_HOLD_55
    m_HashCode: 143860786
  - m_ElementType: 2
    m_Unicode: 65534
    m_GlyphIndex: 56
    m_Scale: 1
    m_Name: CTRL_anim_HOLD_56
    m_HashCode: 143860785
  - m_ElementType: 2
    m_Unicode: 65534
    m_GlyphIndex: 57
    m_Scale: 1
    m_Name: CTRL_anim_HOLD_57
    m_HashCode: 143860784
  - m_ElementType: 2
    m_Unicode: 65534
    m_GlyphIndex: 58
    m_Scale: 1
    m_Name: CTRL_anim_HOLD_58
    m_HashCode: 143860799
  - m_ElementType: 2
    m_Unicode: 65534
    m_GlyphIndex: 59
    m_Scale: 1
    m_Name: CTRL_anim_HOLD_59
    m_HashCode: 143860798
  - m_ElementType: 2
    m_Unicode: 65534
    m_GlyphIndex: 60
    m_Scale: 1
    m_Name: CTRL_anim_HOLD_60
    m_HashCode: 143860628
  - m_ElementType: 2
    m_Unicode: 65534
    m_GlyphIndex: 61
    m_Scale: 1
    m_Name: CTRL_anim_HOLD_61
    m_HashCode: 143860629
  - m_ElementType: 2
    m_Unicode: 65534
    m_GlyphIndex: 62
    m_Scale: 1
    m_Name: CTRL_anim_HOLD_62
    m_HashCode: 143860630
  - m_ElementType: 2
    m_Unicode: 65534
    m_GlyphIndex: 63
    m_Scale: 1
    m_Name: CTRL_anim_HOLD_63
    m_HashCode: 143860631
  - m_ElementType: 2
    m_Unicode: 65534
    m_GlyphIndex: 64
    m_Scale: 1
    m_Name: CTRL_anim_HOLD_64
    m_HashCode: 143860624
  - m_ElementType: 2
    m_Unicode: 65534
    m_GlyphIndex: 65
    m_Scale: 1
    m_Name: CTRL_anim_HOLD_65
    m_HashCode: 143860625
  - m_ElementType: 2
    m_Unicode: 65534
    m_GlyphIndex: 66
    m_Scale: 1
    m_Name: CTRL_anim_HOLD_66
    m_HashCode: 143860626
  - m_ElementType: 2
    m_Unicode: 65534
    m_GlyphIndex: 67
    m_Scale: 1
    m_Name: CTRL_anim_HOLD_67
    m_HashCode: 143860627
  - m_ElementType: 2
    m_Unicode: 65534
    m_GlyphIndex: 68
    m_Scale: 1
    m_Name: CTRL_anim_HOLD_68
    m_HashCode: 143860636
  - m_ElementType: 2
    m_Unicode: 65534
    m_GlyphIndex: 69
    m_Scale: 1
    m_Name: CTRL_anim_HOLD_69
    m_HashCode: 143860637
  - m_ElementType: 2
    m_Unicode: 65534
    m_GlyphIndex: 70
    m_Scale: 1
    m_Name: CTRL_anim_HOLD_70
    m_HashCode: 143860725
  - m_ElementType: 2
    m_Unicode: 65534
    m_GlyphIndex: 71
    m_Scale: 1
    m_Name: CTRL_anim_HOLD_71
    m_HashCode: 143860724
  - m_ElementType: 2
    m_Unicode: 65534
    m_GlyphIndex: 72
    m_Scale: 1
    m_Name: CTRL_anim_HOLD_72
    m_HashCode: 143860727
  - m_ElementType: 2
    m_Unicode: 65534
    m_GlyphIndex: 73
    m_Scale: 1
    m_Name: CTRL_anim_HOLD_73
    m_HashCode: 143860726
  - m_ElementType: 2
    m_Unicode: 65534
    m_GlyphIndex: 74
    m_Scale: 1
    m_Name: CTRL_anim_HOLD_74
    m_HashCode: 143860721
  - m_ElementType: 2
    m_Unicode: 65534
    m_GlyphIndex: 75
    m_Scale: 1
    m_Name: CTRL_anim_HOLD_75
    m_HashCode: 143860720
  - m_ElementType: 2
    m_Unicode: 65534
    m_GlyphIndex: 76
    m_Scale: 1
    m_Name: CTRL_anim_HOLD_76
    m_HashCode: 143860723
  - m_ElementType: 2
    m_Unicode: 65534
    m_GlyphIndex: 77
    m_Scale: 1
    m_Name: CTRL_anim_HOLD_77
    m_HashCode: 143860722
  - m_ElementType: 2
    m_Unicode: 65534
    m_GlyphIndex: 78
    m_Scale: 1
    m_Name: CTRL_anim_HOLD_78
    m_HashCode: 143860733
  - m_ElementType: 2
    m_Unicode: 65534
    m_GlyphIndex: 79
    m_Scale: 1
    m_Name: CTRL_anim_HOLD_79
    m_HashCode: 143860732
  - m_ElementType: 2
    m_Unicode: 65534
    m_GlyphIndex: 80
    m_Scale: 1
    m_Name: CTRL_anim_HOLD_80
    m_HashCode: 143860826
  - m_ElementType: 2
    m_Unicode: 65534
    m_GlyphIndex: 81
    m_Scale: 1
    m_Name: CTRL_anim_HOLD_81
    m_HashCode: 143860827
  - m_ElementType: 2
    m_Unicode: 65534
    m_GlyphIndex: 82
    m_Scale: 1
    m_Name: CTRL_anim_HOLD_82
    m_HashCode: 143860824
  - m_ElementType: 2
    m_Unicode: 65534
    m_GlyphIndex: 83
    m_Scale: 1
    m_Name: CTRL_anim_HOLD_83
    m_HashCode: 143860825
  - m_ElementType: 2
    m_Unicode: 65534
    m_GlyphIndex: 84
    m_Scale: 1
    m_Name: CTRL_anim_HOLD_84
    m_HashCode: 143860830
  - m_ElementType: 2
    m_Unicode: 65534
    m_GlyphIndex: 85
    m_Scale: 1
    m_Name: CTRL_anim_HOLD_85
    m_HashCode: 143860831
  - m_ElementType: 2
    m_Unicode: 65534
    m_GlyphIndex: 86
    m_Scale: 1
    m_Name: CTRL_anim_HOLD_86
    m_HashCode: 143860828
  - m_ElementType: 2
    m_Unicode: 65534
    m_GlyphIndex: 87
    m_Scale: 1
    m_Name: CTRL_anim_HOLD_87
    m_HashCode: 143860829
  - m_ElementType: 2
    m_Unicode: 65534
    m_GlyphIndex: 88
    m_Scale: 1
    m_Name: CTRL_anim_HOLD_88
    m_HashCode: 143860818
  - m_ElementType: 2
    m_Unicode: 65534
    m_GlyphIndex: 89
    m_Scale: 1
    m_Name: CTRL_anim_HOLD_89
    m_HashCode: 143860819
  - m_ElementType: 2
    m_Unicode: 65534
    m_GlyphIndex: 90
    m_Scale: 1
    m_Name: CTRL_anim_HOLD_90
    m_HashCode: 143860923
  - m_ElementType: 2
    m_Unicode: 65534
    m_GlyphIndex: 91
    m_Scale: 1
    m_Name: CTRL_anim_HOLD_91
    m_HashCode: 143860922
  - m_ElementType: 2
    m_Unicode: 65534
    m_GlyphIndex: 92
    m_Scale: 1
    m_Name: CTRL_anim_HOLD_92
    m_HashCode: 143860921
  - m_ElementType: 2
    m_Unicode: 65534
    m_GlyphIndex: 93
    m_Scale: 1
    m_Name: CTRL_anim_HOLD_93
    m_HashCode: 143860920
  - m_ElementType: 2
    m_Unicode: 65534
    m_GlyphIndex: 94
    m_Scale: 1
    m_Name: CTRL_anim_HOLD_94
    m_HashCode: 143860927
  - m_ElementType: 2
    m_Unicode: 65534
    m_GlyphIndex: 95
    m_Scale: 1
    m_Name: CTRL_anim_HOLD_95
    m_HashCode: 143860926
  - m_ElementType: 2
    m_Unicode: 65534
    m_GlyphIndex: 96
    m_Scale: 1
    m_Name: CTRL_anim_HOLD_96
    m_HashCode: 143860925
  - m_ElementType: 2
    m_Unicode: 65534
    m_GlyphIndex: 97
    m_Scale: 1
    m_Name: CTRL_anim_HOLD_97
    m_HashCode: 143860924
  - m_ElementType: 2
    m_Unicode: 65534
    m_GlyphIndex: 98
    m_Scale: 1
    m_Name: CTRL_anim_HOLD_98
    m_HashCode: 143860915
  - m_ElementType: 2
    m_Unicode: 65534
    m_GlyphIndex: 99
    m_Scale: 1
    m_Name: CTRL_anim_HOLD_99
    m_HashCode: 143860914
  - m_ElementType: 2
    m_Unicode: 65534
    m_GlyphIndex: 100
    m_Scale: 1
    m_Name: CTRL_anim_HOLD_100
    m_HashCode: 452434467
  - m_ElementType: 2
    m_Unicode: 65534
    m_GlyphIndex: 101
    m_Scale: 1
    m_Name: CTRL_anim_HOLD_101
    m_HashCode: 452434466
  - m_ElementType: 2
    m_Unicode: 65534
    m_GlyphIndex: 102
    m_Scale: 1
    m_Name: CTRL_anim_HOLD_102
    m_HashCode: 452434465
  - m_ElementType: 2
    m_Unicode: 65534
    m_GlyphIndex: 103
    m_Scale: 1
    m_Name: CTRL_anim_HOLD_103
    m_HashCode: 452434464
  - m_ElementType: 2
    m_Unicode: 65534
    m_GlyphIndex: 104
    m_Scale: 1
    m_Name: CTRL_anim_HOLD_104
    m_HashCode: 452434471
  m_SpriteGlyphTable:
  - m_Index: 0
    m_Metrics:
      m_Width: 136.57143
      m_Height: 136.53334
      m_HorizontalBearingX: -27.314285
      m_HorizontalBearingY: 109.22667
      m_HorizontalAdvance: 136.57143
    m_GlyphRect:
      m_X: 0
      m_Y: 1911
      m_Width: 136
      m_Height: 136
    m_Scale: 1
    m_AtlasIndex: 0
    m_ClassDefinitionType: 0
    sprite: {fileID: 1221331121, guid: 27a021e3ddaddd34cb03bf42b3202346, type: 3}
  - m_Index: 1
    m_Metrics:
      m_Width: 136.57143
      m_Height: 136.53334
      m_HorizontalBearingX: -27.314285
      m_HorizontalBearingY: 109.22667
      m_HorizontalAdvance: 136.57143
    m_GlyphRect:
      m_X: 136
      m_Y: 1911
      m_Width: 136
      m_Height: 136
    m_Scale: 1
    m_AtlasIndex: 0
    m_ClassDefinitionType: 0
    sprite: {fileID: -343115460, guid: 27a021e3ddaddd34cb03bf42b3202346, type: 3}
  - m_Index: 2
    m_Metrics:
      m_Width: 136.57143
      m_Height: 136.53334
      m_HorizontalBearingX: -27.314285
      m_HorizontalBearingY: 109.22667
      m_HorizontalAdvance: 136.57143
    m_GlyphRect:
      m_X: 273
      m_Y: 1911
      m_Width: 136
      m_Height: 136
    m_Scale: 1
    m_AtlasIndex: 0
    m_ClassDefinitionType: 0
    sprite: {fileID: 753299316, guid: 27a021e3ddaddd34cb03bf42b3202346, type: 3}
  - m_Index: 3
    m_Metrics:
      m_Width: 136.57143
      m_Height: 136.53334
      m_HorizontalBearingX: -27.314285
      m_HorizontalBearingY: 109.22667
      m_HorizontalAdvance: 136.57143
    m_GlyphRect:
      m_X: 409
      m_Y: 1911
      m_Width: 136
      m_Height: 136
    m_Scale: 1
    m_AtlasIndex: 0
    m_ClassDefinitionType: 0
    sprite: {fileID: 1801346020, guid: 27a021e3ddaddd34cb03bf42b3202346, type: 3}
  - m_Index: 4
    m_Metrics:
      m_Width: 136.57143
      m_Height: 136.53334
      m_HorizontalBearingX: -27.314285
      m_HorizontalBearingY: 109.22667
      m_HorizontalAdvance: 136.57143
    m_GlyphRect:
      m_X: 546
      m_Y: 1911
      m_Width: 136
      m_Height: 136
    m_Scale: 1
    m_AtlasIndex: 0
    m_ClassDefinitionType: 0
    sprite: {fileID: -1057948962, guid: 27a021e3ddaddd34cb03bf42b3202346, type: 3}
  - m_Index: 5
    m_Metrics:
      m_Width: 136.57143
      m_Height: 136.53334
      m_HorizontalBearingX: -27.314285
      m_HorizontalBearingY: 109.22667
      m_HorizontalAdvance: 136.57143
    m_GlyphRect:
      m_X: 682
      m_Y: 1911
      m_Width: 136
      m_Height: 136
    m_Scale: 1
    m_AtlasIndex: 0
    m_ClassDefinitionType: 0
    sprite: {fileID: -1419598281, guid: 27a021e3ddaddd34cb03bf42b3202346, type: 3}
  - m_Index: 6
    m_Metrics:
      m_Width: 136.57143
      m_Height: 136.53334
      m_HorizontalBearingX: -27.314285
      m_HorizontalBearingY: 109.22667
      m_HorizontalAdvance: 136.57143
    m_GlyphRect:
      m_X: 819
      m_Y: 1911
      m_Width: 136
      m_Height: 136
    m_Scale: 1
    m_AtlasIndex: 0
    m_ClassDefinitionType: 0
    sprite: {fileID: 37505170, guid: 27a021e3ddaddd34cb03bf42b3202346, type: 3}
  - m_Index: 7
    m_Metrics:
      m_Width: 136.57143
      m_Height: 136.53334
      m_HorizontalBearingX: -27.314285
      m_HorizontalBearingY: 109.22667
      m_HorizontalAdvance: 136.57143
    m_GlyphRect:
      m_X: 0
      m_Y: 1774
      m_Width: 136
      m_Height: 136
    m_Scale: 1
    m_AtlasIndex: 0
    m_ClassDefinitionType: 0
    sprite: {fileID: -179232326, guid: 27a021e3ddaddd34cb03bf42b3202346, type: 3}
  - m_Index: 8
    m_Metrics:
      m_Width: 136.57143
      m_Height: 136.53334
      m_HorizontalBearingX: -27.314285
      m_HorizontalBearingY: 109.22667
      m_HorizontalAdvance: 136.57143
    m_GlyphRect:
      m_X: 136
      m_Y: 1774
      m_Width: 136
      m_Height: 136
    m_Scale: 1
    m_AtlasIndex: 0
    m_ClassDefinitionType: 0
    sprite: {fileID: -379445767, guid: 27a021e3ddaddd34cb03bf42b3202346, type: 3}
  - m_Index: 9
    m_Metrics:
      m_Width: 136.57143
      m_Height: 136.53334
      m_HorizontalBearingX: -27.314285
      m_HorizontalBearingY: 109.22667
      m_HorizontalAdvance: 136.57143
    m_GlyphRect:
      m_X: 273
      m_Y: 1774
      m_Width: 136
      m_Height: 136
    m_Scale: 1
    m_AtlasIndex: 0
    m_ClassDefinitionType: 0
    sprite: {fileID: 1139010691, guid: 27a021e3ddaddd34cb03bf42b3202346, type: 3}
  - m_Index: 10
    m_Metrics:
      m_Width: 136.57143
      m_Height: 136.53334
      m_HorizontalBearingX: -27.314285
      m_HorizontalBearingY: 109.22667
      m_HorizontalAdvance: 136.57143
    m_GlyphRect:
      m_X: 409
      m_Y: 1774
      m_Width: 136
      m_Height: 136
    m_Scale: 1
    m_AtlasIndex: 0
    m_ClassDefinitionType: 0
    sprite: {fileID: -375627354, guid: 27a021e3ddaddd34cb03bf42b3202346, type: 3}
  - m_Index: 11
    m_Metrics:
      m_Width: 136.57143
      m_Height: 136.53334
      m_HorizontalBearingX: -27.314285
      m_HorizontalBearingY: 109.22667
      m_HorizontalAdvance: 136.57143
    m_GlyphRect:
      m_X: 546
      m_Y: 1774
      m_Width: 136
      m_Height: 136
    m_Scale: 1
    m_AtlasIndex: 0
    m_ClassDefinitionType: 0
    sprite: {fileID: -865899066, guid: 27a021e3ddaddd34cb03bf42b3202346, type: 3}
  - m_Index: 12
    m_Metrics:
      m_Width: 136.57143
      m_Height: 136.53334
      m_HorizontalBearingX: -27.314285
      m_HorizontalBearingY: 109.22667
      m_HorizontalAdvance: 136.57143
    m_GlyphRect:
      m_X: 682
      m_Y: 1774
      m_Width: 136
      m_Height: 136
    m_Scale: 1
    m_AtlasIndex: 0
    m_ClassDefinitionType: 0
    sprite: {fileID: 868651381, guid: 27a021e3ddaddd34cb03bf42b3202346, type: 3}
  - m_Index: 13
    m_Metrics:
      m_Width: 136.57143
      m_Height: 136.53334
      m_HorizontalBearingX: -27.314285
      m_HorizontalBearingY: 109.22667
      m_HorizontalAdvance: 136.57143
    m_GlyphRect:
      m_X: 819
      m_Y: 1774
      m_Width: 136
      m_Height: 136
    m_Scale: 1
    m_AtlasIndex: 0
    m_ClassDefinitionType: 0
    sprite: {fileID: -1916761741, guid: 27a021e3ddaddd34cb03bf42b3202346, type: 3}
  - m_Index: 14
    m_Metrics:
      m_Width: 136.57143
      m_Height: 136.53334
      m_HorizontalBearingX: -27.314285
      m_HorizontalBearingY: 109.22667
      m_HorizontalAdvance: 136.57143
    m_GlyphRect:
      m_X: 0
      m_Y: 1638
      m_Width: 136
      m_Height: 136
    m_Scale: 1
    m_AtlasIndex: 0
    m_ClassDefinitionType: 0
    sprite: {fileID: 97315552, guid: 27a021e3ddaddd34cb03bf42b3202346, type: 3}
  - m_Index: 15
    m_Metrics:
      m_Width: 136.57143
      m_Height: 136.53334
      m_HorizontalBearingX: -27.314285
      m_HorizontalBearingY: 109.22667
      m_HorizontalAdvance: 136.57143
    m_GlyphRect:
      m_X: 136
      m_Y: 1638
      m_Width: 136
      m_Height: 136
    m_Scale: 1
    m_AtlasIndex: 0
    m_ClassDefinitionType: 0
    sprite: {fileID: -1545974630, guid: 27a021e3ddaddd34cb03bf42b3202346, type: 3}
  - m_Index: 16
    m_Metrics:
      m_Width: 136.57143
      m_Height: 136.53334
      m_HorizontalBearingX: -27.314285
      m_HorizontalBearingY: 109.22667
      m_HorizontalAdvance: 136.57143
    m_GlyphRect:
      m_X: 273
      m_Y: 1638
      m_Width: 136
      m_Height: 136
    m_Scale: 1
    m_AtlasIndex: 0
    m_ClassDefinitionType: 0
    sprite: {fileID: 1924591421, guid: 27a021e3ddaddd34cb03bf42b3202346, type: 3}
  - m_Index: 17
    m_Metrics:
      m_Width: 136.57143
      m_Height: 136.53334
      m_HorizontalBearingX: -27.314285
      m_HorizontalBearingY: 109.22667
      m_HorizontalAdvance: 136.57143
    m_GlyphRect:
      m_X: 409
      m_Y: 1638
      m_Width: 136
      m_Height: 136
    m_Scale: 1
    m_AtlasIndex: 0
    m_ClassDefinitionType: 0
    sprite: {fileID: -1221572208, guid: 27a021e3ddaddd34cb03bf42b3202346, type: 3}
  - m_Index: 18
    m_Metrics:
      m_Width: 136.57143
      m_Height: 136.53334
      m_HorizontalBearingX: -27.314285
      m_HorizontalBearingY: 109.22667
      m_HorizontalAdvance: 136.57143
    m_GlyphRect:
      m_X: 546
      m_Y: 1638
      m_Width: 136
      m_Height: 136
    m_Scale: 1
    m_AtlasIndex: 0
    m_ClassDefinitionType: 0
    sprite: {fileID: -1432364985, guid: 27a021e3ddaddd34cb03bf42b3202346, type: 3}
  - m_Index: 19
    m_Metrics:
      m_Width: 136.57143
      m_Height: 136.53334
      m_HorizontalBearingX: -27.314285
      m_HorizontalBearingY: 109.22667
      m_HorizontalAdvance: 136.57143
    m_GlyphRect:
      m_X: 682
      m_Y: 1638
      m_Width: 136
      m_Height: 136
    m_Scale: 1
    m_AtlasIndex: 0
    m_ClassDefinitionType: 0
    sprite: {fileID: 1469954423, guid: 27a021e3ddaddd34cb03bf42b3202346, type: 3}
  - m_Index: 20
    m_Metrics:
      m_Width: 136.57143
      m_Height: 136.53334
      m_HorizontalBearingX: -27.314285
      m_HorizontalBearingY: 109.22667
      m_HorizontalAdvance: 136.57143
    m_GlyphRect:
      m_X: 819
      m_Y: 1638
      m_Width: 136
      m_Height: 136
    m_Scale: 1
    m_AtlasIndex: 0
    m_ClassDefinitionType: 0
    sprite: {fileID: 735183517, guid: 27a021e3ddaddd34cb03bf42b3202346, type: 3}
  - m_Index: 21
    m_Metrics:
      m_Width: 136.57143
      m_Height: 136.53334
      m_HorizontalBearingX: -27.314285
      m_HorizontalBearingY: 109.22667
      m_HorizontalAdvance: 136.57143
    m_GlyphRect:
      m_X: 0
      m_Y: 1501
      m_Width: 136
      m_Height: 136
    m_Scale: 1
    m_AtlasIndex: 0
    m_ClassDefinitionType: 0
    sprite: {fileID: 626357953, guid: 27a021e3ddaddd34cb03bf42b3202346, type: 3}
  - m_Index: 22
    m_Metrics:
      m_Width: 136.57143
      m_Height: 136.53334
      m_HorizontalBearingX: -27.314285
      m_HorizontalBearingY: 109.22667
      m_HorizontalAdvance: 136.57143
    m_GlyphRect:
      m_X: 136
      m_Y: 1501
      m_Width: 136
      m_Height: 136
    m_Scale: 1
    m_AtlasIndex: 0
    m_ClassDefinitionType: 0
    sprite: {fileID: 1793541337, guid: 27a021e3ddaddd34cb03bf42b3202346, type: 3}
  - m_Index: 23
    m_Metrics:
      m_Width: 136.57143
      m_Height: 136.53334
      m_HorizontalBearingX: -27.314285
      m_HorizontalBearingY: 109.22667
      m_HorizontalAdvance: 136.57143
    m_GlyphRect:
      m_X: 273
      m_Y: 1501
      m_Width: 136
      m_Height: 136
    m_Scale: 1
    m_AtlasIndex: 0
    m_ClassDefinitionType: 0
    sprite: {fileID: -579050518, guid: 27a021e3ddaddd34cb03bf42b3202346, type: 3}
  - m_Index: 24
    m_Metrics:
      m_Width: 136.57143
      m_Height: 136.53334
      m_HorizontalBearingX: -27.314285
      m_HorizontalBearingY: 109.22667
      m_HorizontalAdvance: 136.57143
    m_GlyphRect:
      m_X: 409
      m_Y: 1501
      m_Width: 136
      m_Height: 136
    m_Scale: 1
    m_AtlasIndex: 0
    m_ClassDefinitionType: 0
    sprite: {fileID: -1386777106, guid: 27a021e3ddaddd34cb03bf42b3202346, type: 3}
  - m_Index: 25
    m_Metrics:
      m_Width: 136.57143
      m_Height: 136.53334
      m_HorizontalBearingX: -27.314285
      m_HorizontalBearingY: 109.22667
      m_HorizontalAdvance: 136.57143
    m_GlyphRect:
      m_X: 546
      m_Y: 1501
      m_Width: 136
      m_Height: 136
    m_Scale: 1
    m_AtlasIndex: 0
    m_ClassDefinitionType: 0
    sprite: {fileID: -1595502977, guid: 27a021e3ddaddd34cb03bf42b3202346, type: 3}
  - m_Index: 26
    m_Metrics:
      m_Width: 136.57143
      m_Height: 136.53334
      m_HorizontalBearingX: -27.314285
      m_HorizontalBearingY: 109.22667
      m_HorizontalAdvance: 136.57143
    m_GlyphRect:
      m_X: 682
      m_Y: 1501
      m_Width: 136
      m_Height: 136
    m_Scale: 1
    m_AtlasIndex: 0
    m_ClassDefinitionType: 0
    sprite: {fileID: -443102583, guid: 27a021e3ddaddd34cb03bf42b3202346, type: 3}
  - m_Index: 27
    m_Metrics:
      m_Width: 136.57143
      m_Height: 136.53334
      m_HorizontalBearingX: -27.314285
      m_HorizontalBearingY: 109.22667
      m_HorizontalAdvance: 136.57143
    m_GlyphRect:
      m_X: 819
      m_Y: 1501
      m_Width: 136
      m_Height: 136
    m_Scale: 1
    m_AtlasIndex: 0
    m_ClassDefinitionType: 0
    sprite: {fileID: 1409749468, guid: 27a021e3ddaddd34cb03bf42b3202346, type: 3}
  - m_Index: 28
    m_Metrics:
      m_Width: 136.57143
      m_Height: 136.53334
      m_HorizontalBearingX: -27.314285
      m_HorizontalBearingY: 109.22667
      m_HorizontalAdvance: 136.57143
    m_GlyphRect:
      m_X: 0
      m_Y: 1365
      m_Width: 136
      m_Height: 136
    m_Scale: 1
    m_AtlasIndex: 0
    m_ClassDefinitionType: 0
    sprite: {fileID: -194430225, guid: 27a021e3ddaddd34cb03bf42b3202346, type: 3}
  - m_Index: 29
    m_Metrics:
      m_Width: 136.57143
      m_Height: 136.53334
      m_HorizontalBearingX: -27.314285
      m_HorizontalBearingY: 109.22667
      m_HorizontalAdvance: 136.57143
    m_GlyphRect:
      m_X: 136
      m_Y: 1365
      m_Width: 136
      m_Height: 136
    m_Scale: 1
    m_AtlasIndex: 0
    m_ClassDefinitionType: 0
    sprite: {fileID: -1910943165, guid: 27a021e3ddaddd34cb03bf42b3202346, type: 3}
  - m_Index: 30
    m_Metrics:
      m_Width: 136.57143
      m_Height: 136.53334
      m_HorizontalBearingX: -27.314285
      m_HorizontalBearingY: 109.22667
      m_HorizontalAdvance: 136.57143
    m_GlyphRect:
      m_X: 273
      m_Y: 1365
      m_Width: 136
      m_Height: 136
    m_Scale: 1
    m_AtlasIndex: 0
    m_ClassDefinitionType: 0
    sprite: {fileID: 577814396, guid: 27a021e3ddaddd34cb03bf42b3202346, type: 3}
  - m_Index: 31
    m_Metrics:
      m_Width: 136.57143
      m_Height: 136.53334
      m_HorizontalBearingX: -27.314285
      m_HorizontalBearingY: 109.22667
      m_HorizontalAdvance: 136.57143
    m_GlyphRect:
      m_X: 409
      m_Y: 1365
      m_Width: 136
      m_Height: 136
    m_Scale: 1
    m_AtlasIndex: 0
    m_ClassDefinitionType: 0
    sprite: {fileID: 2108536774, guid: 27a021e3ddaddd34cb03bf42b3202346, type: 3}
  - m_Index: 32
    m_Metrics:
      m_Width: 136.57143
      m_Height: 136.53334
      m_HorizontalBearingX: -27.314285
      m_HorizontalBearingY: 109.22667
      m_HorizontalAdvance: 136.57143
    m_GlyphRect:
      m_X: 546
      m_Y: 1365
      m_Width: 136
      m_Height: 136
    m_Scale: 1
    m_AtlasIndex: 0
    m_ClassDefinitionType: 0
    sprite: {fileID: 1239483087, guid: 27a021e3ddaddd34cb03bf42b3202346, type: 3}
  - m_Index: 33
    m_Metrics:
      m_Width: 136.57143
      m_Height: 136.53334
      m_HorizontalBearingX: -27.314285
      m_HorizontalBearingY: 109.22667
      m_HorizontalAdvance: 136.57143
    m_GlyphRect:
      m_X: 682
      m_Y: 1365
      m_Width: 136
      m_Height: 136
    m_Scale: 1
    m_AtlasIndex: 0
    m_ClassDefinitionType: 0
    sprite: {fileID: -771090475, guid: 27a021e3ddaddd34cb03bf42b3202346, type: 3}
  - m_Index: 34
    m_Metrics:
      m_Width: 136.57143
      m_Height: 136.53334
      m_HorizontalBearingX: -27.314285
      m_HorizontalBearingY: 109.22667
      m_HorizontalAdvance: 136.57143
    m_GlyphRect:
      m_X: 819
      m_Y: 1365
      m_Width: 136
      m_Height: 136
    m_Scale: 1
    m_AtlasIndex: 0
    m_ClassDefinitionType: 0
    sprite: {fileID: -646419334, guid: 27a021e3ddaddd34cb03bf42b3202346, type: 3}
  - m_Index: 35
    m_Metrics:
      m_Width: 136.57143
      m_Height: 136.53334
      m_HorizontalBearingX: -27.314285
      m_HorizontalBearingY: 109.22667
      m_HorizontalAdvance: 136.57143
    m_GlyphRect:
      m_X: 0
      m_Y: 1228
      m_Width: 136
      m_Height: 136
    m_Scale: 1
    m_AtlasIndex: 0
    m_ClassDefinitionType: 0
    sprite: {fileID: -454426024, guid: 27a021e3ddaddd34cb03bf42b3202346, type: 3}
  - m_Index: 36
    m_Metrics:
      m_Width: 136.57143
      m_Height: 136.53334
      m_HorizontalBearingX: -27.314285
      m_HorizontalBearingY: 109.22667
      m_HorizontalAdvance: 136.57143
    m_GlyphRect:
      m_X: 136
      m_Y: 1228
      m_Width: 136
      m_Height: 136
    m_Scale: 1
    m_AtlasIndex: 0
    m_ClassDefinitionType: 0
    sprite: {fileID: 2028637226, guid: 27a021e3ddaddd34cb03bf42b3202346, type: 3}
  - m_Index: 37
    m_Metrics:
      m_Width: 136.57143
      m_Height: 136.53334
      m_HorizontalBearingX: -27.314285
      m_HorizontalBearingY: 109.22667
      m_HorizontalAdvance: 136.57143
    m_GlyphRect:
      m_X: 273
      m_Y: 1228
      m_Width: 136
      m_Height: 136
    m_Scale: 1
    m_AtlasIndex: 0
    m_ClassDefinitionType: 0
    sprite: {fileID: 1744984291, guid: 27a021e3ddaddd34cb03bf42b3202346, type: 3}
  - m_Index: 38
    m_Metrics:
      m_Width: 136.57143
      m_Height: 136.53334
      m_HorizontalBearingX: -27.314285
      m_HorizontalBearingY: 109.22667
      m_HorizontalAdvance: 136.57143
    m_GlyphRect:
      m_X: 409
      m_Y: 1228
      m_Width: 136
      m_Height: 136
    m_Scale: 1
    m_AtlasIndex: 0
    m_ClassDefinitionType: 0
    sprite: {fileID: -704323472, guid: 27a021e3ddaddd34cb03bf42b3202346, type: 3}
  - m_Index: 39
    m_Metrics:
      m_Width: 136.57143
      m_Height: 136.53334
      m_HorizontalBearingX: -27.314285
      m_HorizontalBearingY: 109.22667
      m_HorizontalAdvance: 136.57143
    m_GlyphRect:
      m_X: 546
      m_Y: 1228
      m_Width: 136
      m_Height: 136
    m_Scale: 1
    m_AtlasIndex: 0
    m_ClassDefinitionType: 0
    sprite: {fileID: 1605781291, guid: 27a021e3ddaddd34cb03bf42b3202346, type: 3}
  - m_Index: 40
    m_Metrics:
      m_Width: 136.57143
      m_Height: 136.53334
      m_HorizontalBearingX: -27.314285
      m_HorizontalBearingY: 109.22667
      m_HorizontalAdvance: 136.57143
    m_GlyphRect:
      m_X: 682
      m_Y: 1228
      m_Width: 136
      m_Height: 136
    m_Scale: 1
    m_AtlasIndex: 0
    m_ClassDefinitionType: 0
    sprite: {fileID: -1870538493, guid: 27a021e3ddaddd34cb03bf42b3202346, type: 3}
  - m_Index: 41
    m_Metrics:
      m_Width: 136.57143
      m_Height: 136.53334
      m_HorizontalBearingX: -27.314285
      m_HorizontalBearingY: 109.22667
      m_HorizontalAdvance: 136.57143
    m_GlyphRect:
      m_X: 819
      m_Y: 1228
      m_Width: 136
      m_Height: 136
    m_Scale: 1
    m_AtlasIndex: 0
    m_ClassDefinitionType: 0
    sprite: {fileID: 799991091, guid: 27a021e3ddaddd34cb03bf42b3202346, type: 3}
  - m_Index: 42
    m_Metrics:
      m_Width: 136.57143
      m_Height: 136.53334
      m_HorizontalBearingX: -27.314285
      m_HorizontalBearingY: 109.22667
      m_HorizontalAdvance: 136.57143
    m_GlyphRect:
      m_X: 0
      m_Y: 1092
      m_Width: 136
      m_Height: 136
    m_Scale: 1
    m_AtlasIndex: 0
    m_ClassDefinitionType: 0
    sprite: {fileID: 430998314, guid: 27a021e3ddaddd34cb03bf42b3202346, type: 3}
  - m_Index: 43
    m_Metrics:
      m_Width: 136.57143
      m_Height: 136.53334
      m_HorizontalBearingX: -27.314285
      m_HorizontalBearingY: 109.22667
      m_HorizontalAdvance: 136.57143
    m_GlyphRect:
      m_X: 136
      m_Y: 1092
      m_Width: 136
      m_Height: 136
    m_Scale: 1
    m_AtlasIndex: 0
    m_ClassDefinitionType: 0
    sprite: {fileID: 520486355, guid: 27a021e3ddaddd34cb03bf42b3202346, type: 3}
  - m_Index: 44
    m_Metrics:
      m_Width: 136.57143
      m_Height: 136.53334
      m_HorizontalBearingX: -27.314285
      m_HorizontalBearingY: 109.22667
      m_HorizontalAdvance: 136.57143
    m_GlyphRect:
      m_X: 273
      m_Y: 1092
      m_Width: 136
      m_Height: 136
    m_Scale: 1
    m_AtlasIndex: 0
    m_ClassDefinitionType: 0
    sprite: {fileID: 1628302028, guid: 27a021e3ddaddd34cb03bf42b3202346, type: 3}
  - m_Index: 45
    m_Metrics:
      m_Width: 136.57143
      m_Height: 136.53334
      m_HorizontalBearingX: -27.314285
      m_HorizontalBearingY: 109.22667
      m_HorizontalAdvance: 136.57143
    m_GlyphRect:
      m_X: 409
      m_Y: 1092
      m_Width: 136
      m_Height: 136
    m_Scale: 1
    m_AtlasIndex: 0
    m_ClassDefinitionType: 0
    sprite: {fileID: -413968448, guid: 27a021e3ddaddd34cb03bf42b3202346, type: 3}
  - m_Index: 46
    m_Metrics:
      m_Width: 136.57143
      m_Height: 136.53334
      m_HorizontalBearingX: -27.314285
      m_HorizontalBearingY: 109.22667
      m_HorizontalAdvance: 136.57143
    m_GlyphRect:
      m_X: 546
      m_Y: 1092
      m_Width: 136
      m_Height: 136
    m_Scale: 1
    m_AtlasIndex: 0
    m_ClassDefinitionType: 0
    sprite: {fileID: -603060018, guid: 27a021e3ddaddd34cb03bf42b3202346, type: 3}
  - m_Index: 47
    m_Metrics:
      m_Width: 136.57143
      m_Height: 136.53334
      m_HorizontalBearingX: -27.314285
      m_HorizontalBearingY: 109.22667
      m_HorizontalAdvance: 136.57143
    m_GlyphRect:
      m_X: 682
      m_Y: 1092
      m_Width: 136
      m_Height: 136
    m_Scale: 1
    m_AtlasIndex: 0
    m_ClassDefinitionType: 0
    sprite: {fileID: 2054920471, guid: 27a021e3ddaddd34cb03bf42b3202346, type: 3}
  - m_Index: 48
    m_Metrics:
      m_Width: 136.57143
      m_Height: 136.53334
      m_HorizontalBearingX: -27.314285
      m_HorizontalBearingY: 109.22667
      m_HorizontalAdvance: 136.57143
    m_GlyphRect:
      m_X: 819
      m_Y: 1092
      m_Width: 136
      m_Height: 136
    m_Scale: 1
    m_AtlasIndex: 0
    m_ClassDefinitionType: 0
    sprite: {fileID: 2114358241, guid: 27a021e3ddaddd34cb03bf42b3202346, type: 3}
  - m_Index: 49
    m_Metrics:
      m_Width: 136.57143
      m_Height: 136.53334
      m_HorizontalBearingX: -27.314285
      m_HorizontalBearingY: 109.22667
      m_HorizontalAdvance: 136.57143
    m_GlyphRect:
      m_X: 0
      m_Y: 955
      m_Width: 136
      m_Height: 136
    m_Scale: 1
    m_AtlasIndex: 0
    m_ClassDefinitionType: 0
    sprite: {fileID: 1910340768, guid: 27a021e3ddaddd34cb03bf42b3202346, type: 3}
  - m_Index: 50
    m_Metrics:
      m_Width: 136.57143
      m_Height: 136.53334
      m_HorizontalBearingX: -27.314285
      m_HorizontalBearingY: 109.22667
      m_HorizontalAdvance: 136.57143
    m_GlyphRect:
      m_X: 136
      m_Y: 955
      m_Width: 136
      m_Height: 136
    m_Scale: 1
    m_AtlasIndex: 0
    m_ClassDefinitionType: 0
    sprite: {fileID: 605446842, guid: 27a021e3ddaddd34cb03bf42b3202346, type: 3}
  - m_Index: 51
    m_Metrics:
      m_Width: 136.57143
      m_Height: 136.53334
      m_HorizontalBearingX: -27.314285
      m_HorizontalBearingY: 109.22667
      m_HorizontalAdvance: 136.57143
    m_GlyphRect:
      m_X: 273
      m_Y: 955
      m_Width: 136
      m_Height: 136
    m_Scale: 1
    m_AtlasIndex: 0
    m_ClassDefinitionType: 0
    sprite: {fileID: 1269709953, guid: 27a021e3ddaddd34cb03bf42b3202346, type: 3}
  - m_Index: 52
    m_Metrics:
      m_Width: 136.57143
      m_Height: 136.53334
      m_HorizontalBearingX: -27.314285
      m_HorizontalBearingY: 109.22667
      m_HorizontalAdvance: 136.57143
    m_GlyphRect:
      m_X: 409
      m_Y: 955
      m_Width: 136
      m_Height: 136
    m_Scale: 1
    m_AtlasIndex: 0
    m_ClassDefinitionType: 0
    sprite: {fileID: -2051587983, guid: 27a021e3ddaddd34cb03bf42b3202346, type: 3}
  - m_Index: 53
    m_Metrics:
      m_Width: 136.57143
      m_Height: 136.53334
      m_HorizontalBearingX: -27.314285
      m_HorizontalBearingY: 109.22667
      m_HorizontalAdvance: 136.57143
    m_GlyphRect:
      m_X: 546
      m_Y: 955
      m_Width: 136
      m_Height: 136
    m_Scale: 1
    m_AtlasIndex: 0
    m_ClassDefinitionType: 0
    sprite: {fileID: 2064676069, guid: 27a021e3ddaddd34cb03bf42b3202346, type: 3}
  - m_Index: 54
    m_Metrics:
      m_Width: 136.57143
      m_Height: 136.53334
      m_HorizontalBearingX: -27.314285
      m_HorizontalBearingY: 109.22667
      m_HorizontalAdvance: 136.57143
    m_GlyphRect:
      m_X: 682
      m_Y: 955
      m_Width: 136
      m_Height: 136
    m_Scale: 1
    m_AtlasIndex: 0
    m_ClassDefinitionType: 0
    sprite: {fileID: 2019400184, guid: 27a021e3ddaddd34cb03bf42b3202346, type: 3}
  - m_Index: 55
    m_Metrics:
      m_Width: 136.57143
      m_Height: 136.53334
      m_HorizontalBearingX: -27.314285
      m_HorizontalBearingY: 109.22667
      m_HorizontalAdvance: 136.57143
    m_GlyphRect:
      m_X: 819
      m_Y: 955
      m_Width: 136
      m_Height: 136
    m_Scale: 1
    m_AtlasIndex: 0
    m_ClassDefinitionType: 0
    sprite: {fileID: -367477986, guid: 27a021e3ddaddd34cb03bf42b3202346, type: 3}
  - m_Index: 56
    m_Metrics:
      m_Width: 136.57143
      m_Height: 136.53334
      m_HorizontalBearingX: -27.314285
      m_HorizontalBearingY: 109.22667
      m_HorizontalAdvance: 136.57143
    m_GlyphRect:
      m_X: 0
      m_Y: 819
      m_Width: 136
      m_Height: 136
    m_Scale: 1
    m_AtlasIndex: 0
    m_ClassDefinitionType: 0
    sprite: {fileID: 1010438920, guid: 27a021e3ddaddd34cb03bf42b3202346, type: 3}
  - m_Index: 57
    m_Metrics:
      m_Width: 136.57143
      m_Height: 136.53334
      m_HorizontalBearingX: -27.314285
      m_HorizontalBearingY: 109.22667
      m_HorizontalAdvance: 136.57143
    m_GlyphRect:
      m_X: 136
      m_Y: 819
      m_Width: 136
      m_Height: 136
    m_Scale: 1
    m_AtlasIndex: 0
    m_ClassDefinitionType: 0
    sprite: {fileID: 494226971, guid: 27a021e3ddaddd34cb03bf42b3202346, type: 3}
  - m_Index: 58
    m_Metrics:
      m_Width: 136.57143
      m_Height: 136.53334
      m_HorizontalBearingX: -27.314285
      m_HorizontalBearingY: 109.22667
      m_HorizontalAdvance: 136.57143
    m_GlyphRect:
      m_X: 273
      m_Y: 819
      m_Width: 136
      m_Height: 136
    m_Scale: 1
    m_AtlasIndex: 0
    m_ClassDefinitionType: 0
    sprite: {fileID: -1073929369, guid: 27a021e3ddaddd34cb03bf42b3202346, type: 3}
  - m_Index: 59
    m_Metrics:
      m_Width: 136.57143
      m_Height: 136.53334
      m_HorizontalBearingX: -27.314285
      m_HorizontalBearingY: 109.22667
      m_HorizontalAdvance: 136.57143
    m_GlyphRect:
      m_X: 409
      m_Y: 819
      m_Width: 136
      m_Height: 136
    m_Scale: 1
    m_AtlasIndex: 0
    m_ClassDefinitionType: 0
    sprite: {fileID: -966708082, guid: 27a021e3ddaddd34cb03bf42b3202346, type: 3}
  - m_Index: 60
    m_Metrics:
      m_Width: 136.57143
      m_Height: 136.53334
      m_HorizontalBearingX: -27.314285
      m_HorizontalBearingY: 109.22667
      m_HorizontalAdvance: 136.57143
    m_GlyphRect:
      m_X: 546
      m_Y: 819
      m_Width: 136
      m_Height: 136
    m_Scale: 1
    m_AtlasIndex: 0
    m_ClassDefinitionType: 0
    sprite: {fileID: -1087522736, guid: 27a021e3ddaddd34cb03bf42b3202346, type: 3}
  - m_Index: 61
    m_Metrics:
      m_Width: 136.57143
      m_Height: 136.53334
      m_HorizontalBearingX: -27.314285
      m_HorizontalBearingY: 109.22667
      m_HorizontalAdvance: 136.57143
    m_GlyphRect:
      m_X: 682
      m_Y: 819
      m_Width: 136
      m_Height: 136
    m_Scale: 1
    m_AtlasIndex: 0
    m_ClassDefinitionType: 0
    sprite: {fileID: 1902274189, guid: 27a021e3ddaddd34cb03bf42b3202346, type: 3}
  - m_Index: 62
    m_Metrics:
      m_Width: 136.57143
      m_Height: 136.53334
      m_HorizontalBearingX: -27.314285
      m_HorizontalBearingY: 109.22667
      m_HorizontalAdvance: 136.57143
    m_GlyphRect:
      m_X: 819
      m_Y: 819
      m_Width: 136
      m_Height: 136
    m_Scale: 1
    m_AtlasIndex: 0
    m_ClassDefinitionType: 0
    sprite: {fileID: 581459670, guid: 27a021e3ddaddd34cb03bf42b3202346, type: 3}
  - m_Index: 63
    m_Metrics:
      m_Width: 136.57143
      m_Height: 136.53334
      m_HorizontalBearingX: -27.314285
      m_HorizontalBearingY: 109.22667
      m_HorizontalAdvance: 136.57143
    m_GlyphRect:
      m_X: 0
      m_Y: 682
      m_Width: 136
      m_Height: 136
    m_Scale: 1
    m_AtlasIndex: 0
    m_ClassDefinitionType: 0
    sprite: {fileID: -1996275510, guid: 27a021e3ddaddd34cb03bf42b3202346, type: 3}
  - m_Index: 64
    m_Metrics:
      m_Width: 136.57143
      m_Height: 136.53334
      m_HorizontalBearingX: -27.314285
      m_HorizontalBearingY: 109.22667
      m_HorizontalAdvance: 136.57143
    m_GlyphRect:
      m_X: 136
      m_Y: 682
      m_Width: 136
      m_Height: 136
    m_Scale: 1
    m_AtlasIndex: 0
    m_ClassDefinitionType: 0
    sprite: {fileID: 1675801773, guid: 27a021e3ddaddd34cb03bf42b3202346, type: 3}
  - m_Index: 65
    m_Metrics:
      m_Width: 136.57143
      m_Height: 136.53334
      m_HorizontalBearingX: -27.314285
      m_HorizontalBearingY: 109.22667
      m_HorizontalAdvance: 136.57143
    m_GlyphRect:
      m_X: 273
      m_Y: 682
      m_Width: 136
      m_Height: 136
    m_Scale: 1
    m_AtlasIndex: 0
    m_ClassDefinitionType: 0
    sprite: {fileID: -2102372959, guid: 27a021e3ddaddd34cb03bf42b3202346, type: 3}
  - m_Index: 66
    m_Metrics:
      m_Width: 136.57143
      m_Height: 136.53334
      m_HorizontalBearingX: -27.314285
      m_HorizontalBearingY: 109.22667
      m_HorizontalAdvance: 136.57143
    m_GlyphRect:
      m_X: 409
      m_Y: 682
      m_Width: 136
      m_Height: 136
    m_Scale: 1
    m_AtlasIndex: 0
    m_ClassDefinitionType: 0
    sprite: {fileID: -248663497, guid: 27a021e3ddaddd34cb03bf42b3202346, type: 3}
  - m_Index: 67
    m_Metrics:
      m_Width: 136.57143
      m_Height: 136.53334
      m_HorizontalBearingX: -27.314285
      m_HorizontalBearingY: 109.22667
      m_HorizontalAdvance: 136.57143
    m_GlyphRect:
      m_X: 546
      m_Y: 682
      m_Width: 136
      m_Height: 136
    m_Scale: 1
    m_AtlasIndex: 0
    m_ClassDefinitionType: 0
    sprite: {fileID: -1643107556, guid: 27a021e3ddaddd34cb03bf42b3202346, type: 3}
  - m_Index: 68
    m_Metrics:
      m_Width: 136.57143
      m_Height: 136.53334
      m_HorizontalBearingX: -27.314285
      m_HorizontalBearingY: 109.22667
      m_HorizontalAdvance: 136.57143
    m_GlyphRect:
      m_X: 682
      m_Y: 682
      m_Width: 136
      m_Height: 136
    m_Scale: 1
    m_AtlasIndex: 0
    m_ClassDefinitionType: 0
    sprite: {fileID: -1904737412, guid: 27a021e3ddaddd34cb03bf42b3202346, type: 3}
  - m_Index: 69
    m_Metrics:
      m_Width: 136.57143
      m_Height: 136.53334
      m_HorizontalBearingX: -27.314285
      m_HorizontalBearingY: 109.22667
      m_HorizontalAdvance: 136.57143
    m_GlyphRect:
      m_X: 819
      m_Y: 682
      m_Width: 136
      m_Height: 136
    m_Scale: 1
    m_AtlasIndex: 0
    m_ClassDefinitionType: 0
    sprite: {fileID: 1309051501, guid: 27a021e3ddaddd34cb03bf42b3202346, type: 3}
  - m_Index: 70
    m_Metrics:
      m_Width: 136.57143
      m_Height: 136.53334
      m_HorizontalBearingX: -27.314285
      m_HorizontalBearingY: 109.22667
      m_HorizontalAdvance: 136.57143
    m_GlyphRect:
      m_X: 0
      m_Y: 546
      m_Width: 136
      m_Height: 136
    m_Scale: 1
    m_AtlasIndex: 0
    m_ClassDefinitionType: 0
    sprite: {fileID: 1973114895, guid: 27a021e3ddaddd34cb03bf42b3202346, type: 3}
  - m_Index: 71
    m_Metrics:
      m_Width: 136.57143
      m_Height: 136.53334
      m_HorizontalBearingX: -27.314285
      m_HorizontalBearingY: 109.22667
      m_HorizontalAdvance: 136.57143
    m_GlyphRect:
      m_X: 136
      m_Y: 546
      m_Width: 136
      m_Height: 136
    m_Scale: 1
    m_AtlasIndex: 0
    m_ClassDefinitionType: 0
    sprite: {fileID: -153549843, guid: 27a021e3ddaddd34cb03bf42b3202346, type: 3}
  - m_Index: 72
    m_Metrics:
      m_Width: 136.57143
      m_Height: 136.53334
      m_HorizontalBearingX: -27.314285
      m_HorizontalBearingY: 109.22667
      m_HorizontalAdvance: 136.57143
    m_GlyphRect:
      m_X: 273
      m_Y: 546
      m_Width: 136
      m_Height: 136
    m_Scale: 1
    m_AtlasIndex: 0
    m_ClassDefinitionType: 0
    sprite: {fileID: 1748493099, guid: 27a021e3ddaddd34cb03bf42b3202346, type: 3}
  - m_Index: 73
    m_Metrics:
      m_Width: 136.57143
      m_Height: 136.53334
      m_HorizontalBearingX: -27.314285
      m_HorizontalBearingY: 109.22667
      m_HorizontalAdvance: 136.57143
    m_GlyphRect:
      m_X: 409
      m_Y: 546
      m_Width: 136
      m_Height: 136
    m_Scale: 1
    m_AtlasIndex: 0
    m_ClassDefinitionType: 0
    sprite: {fileID: -355942620, guid: 27a021e3ddaddd34cb03bf42b3202346, type: 3}
  - m_Index: 74
    m_Metrics:
      m_Width: 136.57143
      m_Height: 136.53334
      m_HorizontalBearingX: -27.314285
      m_HorizontalBearingY: 109.22667
      m_HorizontalAdvance: 136.57143
    m_GlyphRect:
      m_X: 546
      m_Y: 546
      m_Width: 136
      m_Height: 136
    m_Scale: 1
    m_AtlasIndex: 0
    m_ClassDefinitionType: 0
    sprite: {fileID: -1846637134, guid: 27a021e3ddaddd34cb03bf42b3202346, type: 3}
  - m_Index: 75
    m_Metrics:
      m_Width: 136.57143
      m_Height: 136.53334
      m_HorizontalBearingX: -27.314285
      m_HorizontalBearingY: 109.22667
      m_HorizontalAdvance: 136.57143
    m_GlyphRect:
      m_X: 682
      m_Y: 546
      m_Width: 136
      m_Height: 136
    m_Scale: 1
    m_AtlasIndex: 0
    m_ClassDefinitionType: 0
    sprite: {fileID: -1369414036, guid: 27a021e3ddaddd34cb03bf42b3202346, type: 3}
  - m_Index: 76
    m_Metrics:
      m_Width: 136.57143
      m_Height: 136.53334
      m_HorizontalBearingX: -27.314285
      m_HorizontalBearingY: 109.22667
      m_HorizontalAdvance: 136.57143
    m_GlyphRect:
      m_X: 819
      m_Y: 546
      m_Width: 136
      m_Height: 136
    m_Scale: 1
    m_AtlasIndex: 0
    m_ClassDefinitionType: 0
    sprite: {fileID: 796809536, guid: 27a021e3ddaddd34cb03bf42b3202346, type: 3}
  - m_Index: 77
    m_Metrics:
      m_Width: 136.57143
      m_Height: 136.53334
      m_HorizontalBearingX: -27.314285
      m_HorizontalBearingY: 109.22667
      m_HorizontalAdvance: 136.57143
    m_GlyphRect:
      m_X: 0
      m_Y: 409
      m_Width: 136
      m_Height: 136
    m_Scale: 1
    m_AtlasIndex: 0
    m_ClassDefinitionType: 0
    sprite: {fileID: -1512516450, guid: 27a021e3ddaddd34cb03bf42b3202346, type: 3}
  - m_Index: 78
    m_Metrics:
      m_Width: 136.57143
      m_Height: 136.53334
      m_HorizontalBearingX: -27.314285
      m_HorizontalBearingY: 109.22667
      m_HorizontalAdvance: 136.57143
    m_GlyphRect:
      m_X: 136
      m_Y: 409
      m_Width: 136
      m_Height: 136
    m_Scale: 1
    m_AtlasIndex: 0
    m_ClassDefinitionType: 0
    sprite: {fileID: 654864941, guid: 27a021e3ddaddd34cb03bf42b3202346, type: 3}
  - m_Index: 79
    m_Metrics:
      m_Width: 136.57143
      m_Height: 136.53334
      m_HorizontalBearingX: -27.314285
      m_HorizontalBearingY: 109.22667
      m_HorizontalAdvance: 136.57143
    m_GlyphRect:
      m_X: 273
      m_Y: 409
      m_Width: 136
      m_Height: 136
    m_Scale: 1
    m_AtlasIndex: 0
    m_ClassDefinitionType: 0
    sprite: {fileID: -1006469289, guid: 27a021e3ddaddd34cb03bf42b3202346, type: 3}
  - m_Index: 80
    m_Metrics:
      m_Width: 136.57143
      m_Height: 136.53334
      m_HorizontalBearingX: -27.314285
      m_HorizontalBearingY: 109.22667
      m_HorizontalAdvance: 136.57143
    m_GlyphRect:
      m_X: 409
      m_Y: 409
      m_Width: 136
      m_Height: 136
    m_Scale: 1
    m_AtlasIndex: 0
    m_ClassDefinitionType: 0
    sprite: {fileID: -1967244789, guid: 27a021e3ddaddd34cb03bf42b3202346, type: 3}
  - m_Index: 81
    m_Metrics:
      m_Width: 136.57143
      m_Height: 136.53334
      m_HorizontalBearingX: -27.314285
      m_HorizontalBearingY: 109.22667
      m_HorizontalAdvance: 136.57143
    m_GlyphRect:
      m_X: 546
      m_Y: 409
      m_Width: 136
      m_Height: 136
    m_Scale: 1
    m_AtlasIndex: 0
    m_ClassDefinitionType: 0
    sprite: {fileID: -368942018, guid: 27a021e3ddaddd34cb03bf42b3202346, type: 3}
  - m_Index: 82
    m_Metrics:
      m_Width: 136.57143
      m_Height: 136.53334
      m_HorizontalBearingX: -27.314285
      m_HorizontalBearingY: 109.22667
      m_HorizontalAdvance: 136.57143
    m_GlyphRect:
      m_X: 682
      m_Y: 409
      m_Width: 136
      m_Height: 136
    m_Scale: 1
    m_AtlasIndex: 0
    m_ClassDefinitionType: 0
    sprite: {fileID: 1332429510, guid: 27a021e3ddaddd34cb03bf42b3202346, type: 3}
  - m_Index: 83
    m_Metrics:
      m_Width: 136.57143
      m_Height: 136.53334
      m_HorizontalBearingX: -27.314285
      m_HorizontalBearingY: 109.22667
      m_HorizontalAdvance: 136.57143
    m_GlyphRect:
      m_X: 819
      m_Y: 409
      m_Width: 136
      m_Height: 136
    m_Scale: 1
    m_AtlasIndex: 0
    m_ClassDefinitionType: 0
    sprite: {fileID: -1994570111, guid: 27a021e3ddaddd34cb03bf42b3202346, type: 3}
  - m_Index: 84
    m_Metrics:
      m_Width: 136.57143
      m_Height: 136.53334
      m_HorizontalBearingX: -27.314285
      m_HorizontalBearingY: 109.22667
      m_HorizontalAdvance: 136.57143
    m_GlyphRect:
      m_X: 0
      m_Y: 273
      m_Width: 136
      m_Height: 136
    m_Scale: 1
    m_AtlasIndex: 0
    m_ClassDefinitionType: 0
    sprite: {fileID: 1780265204, guid: 27a021e3ddaddd34cb03bf42b3202346, type: 3}
  - m_Index: 85
    m_Metrics:
      m_Width: 136.57143
      m_Height: 136.53334
      m_HorizontalBearingX: -27.314285
      m_HorizontalBearingY: 109.22667
      m_HorizontalAdvance: 136.57143
    m_GlyphRect:
      m_X: 136
      m_Y: 273
      m_Width: 136
      m_Height: 136
    m_Scale: 1
    m_AtlasIndex: 0
    m_ClassDefinitionType: 0
    sprite: {fileID: 998782722, guid: 27a021e3ddaddd34cb03bf42b3202346, type: 3}
  - m_Index: 86
    m_Metrics:
      m_Width: 136.57143
      m_Height: 136.53334
      m_HorizontalBearingX: -27.314285
      m_HorizontalBearingY: 109.22667
      m_HorizontalAdvance: 136.57143
    m_GlyphRect:
      m_X: 273
      m_Y: 273
      m_Width: 136
      m_Height: 136
    m_Scale: 1
    m_AtlasIndex: 0
    m_ClassDefinitionType: 0
    sprite: {fileID: 153653534, guid: 27a021e3ddaddd34cb03bf42b3202346, type: 3}
  - m_Index: 87
    m_Metrics:
      m_Width: 136.57143
      m_Height: 136.53334
      m_HorizontalBearingX: -27.314285
      m_HorizontalBearingY: 109.22667
      m_HorizontalAdvance: 136.57143
    m_GlyphRect:
      m_X: 409
      m_Y: 273
      m_Width: 136
      m_Height: 136
    m_Scale: 1
    m_AtlasIndex: 0
    m_ClassDefinitionType: 0
    sprite: {fileID: 884714697, guid: 27a021e3ddaddd34cb03bf42b3202346, type: 3}
  - m_Index: 88
    m_Metrics:
      m_Width: 136.57143
      m_Height: 136.53334
      m_HorizontalBearingX: -27.314285
      m_HorizontalBearingY: 109.22667
      m_HorizontalAdvance: 136.57143
    m_GlyphRect:
      m_X: 546
      m_Y: 273
      m_Width: 136
      m_Height: 136
    m_Scale: 1
    m_AtlasIndex: 0
    m_ClassDefinitionType: 0
    sprite: {fileID: -603535990, guid: 27a021e3ddaddd34cb03bf42b3202346, type: 3}
  - m_Index: 89
    m_Metrics:
      m_Width: 136.57143
      m_Height: 136.53334
      m_HorizontalBearingX: -27.314285
      m_HorizontalBearingY: 109.22667
      m_HorizontalAdvance: 136.57143
    m_GlyphRect:
      m_X: 682
      m_Y: 273
      m_Width: 136
      m_Height: 136
    m_Scale: 1
    m_AtlasIndex: 0
    m_ClassDefinitionType: 0
    sprite: {fileID: -1700171293, guid: 27a021e3ddaddd34cb03bf42b3202346, type: 3}
  - m_Index: 90
    m_Metrics:
      m_Width: 136.57143
      m_Height: 136.53334
      m_HorizontalBearingX: -27.314285
      m_HorizontalBearingY: 109.22667
      m_HorizontalAdvance: 136.57143
    m_GlyphRect:
      m_X: 819
      m_Y: 273
      m_Width: 136
      m_Height: 136
    m_Scale: 1
    m_AtlasIndex: 0
    m_ClassDefinitionType: 0
    sprite: {fileID: 1373879121, guid: 27a021e3ddaddd34cb03bf42b3202346, type: 3}
  - m_Index: 91
    m_Metrics:
      m_Width: 136.57143
      m_Height: 136.53334
      m_HorizontalBearingX: -27.314285
      m_HorizontalBearingY: 109.22667
      m_HorizontalAdvance: 136.57143
    m_GlyphRect:
      m_X: 0
      m_Y: 136
      m_Width: 136
      m_Height: 136
    m_Scale: 1
    m_AtlasIndex: 0
    m_ClassDefinitionType: 0
    sprite: {fileID: -1069116563, guid: 27a021e3ddaddd34cb03bf42b3202346, type: 3}
  - m_Index: 92
    m_Metrics:
      m_Width: 136.57143
      m_Height: 136.53334
      m_HorizontalBearingX: -27.314285
      m_HorizontalBearingY: 109.22667
      m_HorizontalAdvance: 136.57143
    m_GlyphRect:
      m_X: 136
      m_Y: 136
      m_Width: 136
      m_Height: 136
    m_Scale: 1
    m_AtlasIndex: 0
    m_ClassDefinitionType: 0
    sprite: {fileID: -1176741725, guid: 27a021e3ddaddd34cb03bf42b3202346, type: 3}
  - m_Index: 93
    m_Metrics:
      m_Width: 136.57143
      m_Height: 136.53334
      m_HorizontalBearingX: -27.314285
      m_HorizontalBearingY: 109.22667
      m_HorizontalAdvance: 136.57143
    m_GlyphRect:
      m_X: 273
      m_Y: 136
      m_Width: 136
      m_Height: 136
    m_Scale: 1
    m_AtlasIndex: 0
    m_ClassDefinitionType: 0
    sprite: {fileID: 1065638105, guid: 27a021e3ddaddd34cb03bf42b3202346, type: 3}
  - m_Index: 94
    m_Metrics:
      m_Width: 136.57143
      m_Height: 136.53334
      m_HorizontalBearingX: -27.314285
      m_HorizontalBearingY: 109.22667
      m_HorizontalAdvance: 136.57143
    m_GlyphRect:
      m_X: 409
      m_Y: 136
      m_Width: 136
      m_Height: 136
    m_Scale: 1
    m_AtlasIndex: 0
    m_ClassDefinitionType: 0
    sprite: {fileID: -100255736, guid: 27a021e3ddaddd34cb03bf42b3202346, type: 3}
  - m_Index: 95
    m_Metrics:
      m_Width: 136.57143
      m_Height: 136.53334
      m_HorizontalBearingX: -27.314285
      m_HorizontalBearingY: 109.22667
      m_HorizontalAdvance: 136.57143
    m_GlyphRect:
      m_X: 546
      m_Y: 136
      m_Width: 136
      m_Height: 136
    m_Scale: 1
    m_AtlasIndex: 0
    m_ClassDefinitionType: 0
    sprite: {fileID: 951001016, guid: 27a021e3ddaddd34cb03bf42b3202346, type: 3}
  - m_Index: 96
    m_Metrics:
      m_Width: 136.57143
      m_Height: 136.53334
      m_HorizontalBearingX: -27.314285
      m_HorizontalBearingY: 109.22667
      m_HorizontalAdvance: 136.57143
    m_GlyphRect:
      m_X: 682
      m_Y: 136
      m_Width: 136
      m_Height: 136
    m_Scale: 1
    m_AtlasIndex: 0
    m_ClassDefinitionType: 0
    sprite: {fileID: 346310892, guid: 27a021e3ddaddd34cb03bf42b3202346, type: 3}
  - m_Index: 97
    m_Metrics:
      m_Width: 136.57143
      m_Height: 136.53334
      m_HorizontalBearingX: -27.314285
      m_HorizontalBearingY: 109.22667
      m_HorizontalAdvance: 136.57143
    m_GlyphRect:
      m_X: 819
      m_Y: 136
      m_Width: 136
      m_Height: 136
    m_Scale: 1
    m_AtlasIndex: 0
    m_ClassDefinitionType: 0
    sprite: {fileID: -1419429633, guid: 27a021e3ddaddd34cb03bf42b3202346, type: 3}
  - m_Index: 98
    m_Metrics:
      m_Width: 136.57143
      m_Height: 136.53334
      m_HorizontalBearingX: -27.314285
      m_HorizontalBearingY: 109.22667
      m_HorizontalAdvance: 136.57143
    m_GlyphRect:
      m_X: 0
      m_Y: 0
      m_Width: 136
      m_Height: 136
    m_Scale: 1
    m_AtlasIndex: 0
    m_ClassDefinitionType: 0
    sprite: {fileID: -1231342913, guid: 27a021e3ddaddd34cb03bf42b3202346, type: 3}
  - m_Index: 99
    m_Metrics:
      m_Width: 136.57143
      m_Height: 136.53334
      m_HorizontalBearingX: -27.314285
      m_HorizontalBearingY: 109.22667
      m_HorizontalAdvance: 136.57143
    m_GlyphRect:
      m_X: 136
      m_Y: 0
      m_Width: 136
      m_Height: 136
    m_Scale: 1
    m_AtlasIndex: 0
    m_ClassDefinitionType: 0
    sprite: {fileID: 1841572226, guid: 27a021e3ddaddd34cb03bf42b3202346, type: 3}
  - m_Index: 100
    m_Metrics:
      m_Width: 136.57143
      m_Height: 136.53334
      m_HorizontalBearingX: -27.314285
      m_HorizontalBearingY: 109.22667
      m_HorizontalAdvance: 136.57143
    m_GlyphRect:
      m_X: 273
      m_Y: 0
      m_Width: 136
      m_Height: 136
    m_Scale: 1
    m_AtlasIndex: 0
    m_ClassDefinitionType: 0
    sprite: {fileID: 1611934826, guid: 27a021e3ddaddd34cb03bf42b3202346, type: 3}
  - m_Index: 101
    m_Metrics:
      m_Width: 136.57143
      m_Height: 136.53334
      m_HorizontalBearingX: -27.314285
      m_HorizontalBearingY: 109.22667
      m_HorizontalAdvance: 136.57143
    m_GlyphRect:
      m_X: 409
      m_Y: 0
      m_Width: 136
      m_Height: 136
    m_Scale: 1
    m_AtlasIndex: 0
    m_ClassDefinitionType: 0
    sprite: {fileID: -787235918, guid: 27a021e3ddaddd34cb03bf42b3202346, type: 3}
  - m_Index: 102
    m_Metrics:
      m_Width: 136.57143
      m_Height: 136.53334
      m_HorizontalBearingX: -27.314285
      m_HorizontalBearingY: 109.22667
      m_HorizontalAdvance: 136.57143
    m_GlyphRect:
      m_X: 546
      m_Y: 0
      m_Width: 136
      m_Height: 136
    m_Scale: 1
    m_AtlasIndex: 0
    m_ClassDefinitionType: 0
    sprite: {fileID: -546128722, guid: 27a021e3ddaddd34cb03bf42b3202346, type: 3}
  - m_Index: 103
    m_Metrics:
      m_Width: 136.57143
      m_Height: 136.53334
      m_HorizontalBearingX: -27.314285
      m_HorizontalBearingY: 109.22667
      m_HorizontalAdvance: 136.57143
    m_GlyphRect:
      m_X: 682
      m_Y: 0
      m_Width: 136
      m_Height: 136
    m_Scale: 1
    m_AtlasIndex: 0
    m_ClassDefinitionType: 0
    sprite: {fileID: 1729253901, guid: 27a021e3ddaddd34cb03bf42b3202346, type: 3}
  - m_Index: 104
    m_Metrics:
      m_Width: 136.57143
      m_Height: 136.53334
      m_HorizontalBearingX: -27.314285
      m_HorizontalBearingY: 109.22667
      m_HorizontalAdvance: 136.57143
    m_GlyphRect:
      m_X: 819
      m_Y: 0
      m_Width: 136
      m_Height: 136
    m_Scale: 1
    m_AtlasIndex: 0
    m_ClassDefinitionType: 0
    sprite: {fileID: -1630462665, guid: 27a021e3ddaddd34cb03bf42b3202346, type: 3}
  spriteInfoList: []
  fallbackSpriteAssets: []
