%YAML 1.1
%TAG !u! tag:unity3d.com,2011:
--- !u!1001 &6809859505751769667
PrefabInstance:
  m_ObjectHideFlags: 0
  serializedVersion: 2
  m_Modification:
    serializedVersion: 3
    m_TransformParent: {fileID: 0}
    m_Modifications:
    - target: {fileID: -8679921383154817045, guid: c974622929a7af348b0d4f8ed54bd9e2, type: 3}
      propertyPath: m_LocalPosition.x
      value: 29.119188
      objectReference: {fileID: 0}
    - target: {fileID: -8679921383154817045, guid: c974622929a7af348b0d4f8ed54bd9e2, type: 3}
      propertyPath: m_LocalPosition.y
      value: 0
      objectReference: {fileID: 0}
    - target: {fileID: -8679921383154817045, guid: c974622929a7af348b0d4f8ed54bd9e2, type: 3}
      propertyPath: m_LocalPosition.z
      value: 8.150866
      objectReference: {fileID: 0}
    - target: {fileID: -8679921383154817045, guid: c974622929a7af348b0d4f8ed54bd9e2, type: 3}
      propertyPath: m_LocalRotation.w
      value: 0.7071067
      objectReference: {fileID: 0}
    - target: {fileID: -8679921383154817045, guid: c974622929a7af348b0d4f8ed54bd9e2, type: 3}
      propertyPath: m_LocalRotation.x
      value: -0.7071068
      objectReference: {fileID: 0}
    - target: {fileID: -8679921383154817045, guid: c974622929a7af348b0d4f8ed54bd9e2, type: 3}
      propertyPath: m_LocalRotation.y
      value: 0
      objectReference: {fileID: 0}
    - target: {fileID: -8679921383154817045, guid: c974622929a7af348b0d4f8ed54bd9e2, type: 3}
      propertyPath: m_LocalRotation.z
      value: -0
      objectReference: {fileID: 0}
    - target: {fileID: -8679921383154817045, guid: c974622929a7af348b0d4f8ed54bd9e2, type: 3}
      propertyPath: m_LocalEulerAnglesHint.x
      value: 0
      objectReference: {fileID: 0}
    - target: {fileID: -8679921383154817045, guid: c974622929a7af348b0d4f8ed54bd9e2, type: 3}
      propertyPath: m_LocalEulerAnglesHint.y
      value: 0
      objectReference: {fileID: 0}
    - target: {fileID: -8679921383154817045, guid: c974622929a7af348b0d4f8ed54bd9e2, type: 3}
      propertyPath: m_LocalEulerAnglesHint.z
      value: 0
      objectReference: {fileID: 0}
    - target: {fileID: 919132149155446097, guid: c974622929a7af348b0d4f8ed54bd9e2, type: 3}
      propertyPath: m_Name
      value: Tomb_Door_Left
      objectReference: {fileID: 0}
    m_RemovedComponents: []
    m_RemovedGameObjects: []
    m_AddedGameObjects: []
    m_AddedComponents:
    - targetCorrespondingSourceObject: {fileID: 919132149155446097, guid: c974622929a7af348b0d4f8ed54bd9e2, type: 3}
      insertIndex: -1
      addedObject: {fileID: 4808959658162633861}
  m_SourcePrefab: {fileID: 100100000, guid: c974622929a7af348b0d4f8ed54bd9e2, type: 3}
--- !u!1 &5926757940457111314 stripped
GameObject:
  m_CorrespondingSourceObject: {fileID: 919132149155446097, guid: c974622929a7af348b0d4f8ed54bd9e2, type: 3}
  m_PrefabInstance: {fileID: 6809859505751769667}
  m_PrefabAsset: {fileID: 0}
--- !u!65 &4808959658162633861
BoxCollider:
  m_ObjectHideFlags: 0
  m_CorrespondingSourceObject: {fileID: 0}
  m_PrefabInstance: {fileID: 0}
  m_PrefabAsset: {fileID: 0}
  m_GameObject: {fileID: 5926757940457111314}
  m_Material: {fileID: 0}
  m_IncludeLayers:
    serializedVersion: 2
    m_Bits: 0
  m_ExcludeLayers:
    serializedVersion: 2
    m_Bits: 0
  m_LayerOverridePriority: 0
  m_IsTrigger: 0
  m_ProvidesContacts: 0
  m_Enabled: 1
  serializedVersion: 3
  m_Size: {x: 1.3957913, y: 0.19222867, z: 2.1567602}
  m_Center: {x: 0.000003516674, y: -0.021626664, z: 1.0783801}
