%YAML 1.1
%TAG !u! tag:unity3d.com,2011:
--- !u!1 &1326179478803599634
GameObject:
  m_ObjectHideFlags: 0
  m_CorrespondingSourceObject: {fileID: 0}
  m_PrefabInstance: {fileID: 0}
  m_PrefabAsset: {fileID: 0}
  serializedVersion: 6
  m_Component:
  - component: {fileID: 5729075165928102152}
  m_Layer: 0
  m_Name: WallHole_3.2
  m_TagString: Untagged
  m_Icon: {fileID: 0}
  m_NavMeshLayer: 0
  m_StaticEditorFlags: 0
  m_IsActive: 1
--- !u!4 &5729075165928102152
Transform:
  m_ObjectHideFlags: 0
  m_CorrespondingSourceObject: {fileID: 0}
  m_PrefabInstance: {fileID: 0}
  m_PrefabAsset: {fileID: 0}
  m_GameObject: {fileID: 1326179478803599634}
  serializedVersion: 2
  m_LocalRotation: {x: 0, y: 0, z: 0, w: 1}
  m_LocalPosition: {x: 0, y: 0, z: 0}
  m_LocalScale: {x: 1, y: 1, z: 1}
  m_ConstrainProportionsScale: 0
  m_Children:
  - {fileID: 8446240855029912523}
  - {fileID: 7297065346286048120}
  m_Father: {fileID: 0}
  m_LocalEulerAnglesHint: {x: 0, y: 0, z: 0}
--- !u!1001 &896590188519313489
PrefabInstance:
  m_ObjectHideFlags: 0
  serializedVersion: 2
  m_Modification:
    serializedVersion: 3
    m_TransformParent: {fileID: 5729075165928102152}
    m_Modifications:
    - target: {fileID: 1607430413286553509, guid: e822dc5ea4d208e439e360c3cceec7a1, type: 3}
      propertyPath: m_Name
      value: Spikes
      objectReference: {fileID: 0}
    - target: {fileID: 7581025213232055081, guid: e822dc5ea4d208e439e360c3cceec7a1, type: 3}
      propertyPath: m_LocalPosition.x
      value: 0
      objectReference: {fileID: 0}
    - target: {fileID: 7581025213232055081, guid: e822dc5ea4d208e439e360c3cceec7a1, type: 3}
      propertyPath: m_LocalPosition.y
      value: 0
      objectReference: {fileID: 0}
    - target: {fileID: 7581025213232055081, guid: e822dc5ea4d208e439e360c3cceec7a1, type: 3}
      propertyPath: m_LocalPosition.z
      value: 0
      objectReference: {fileID: 0}
    - target: {fileID: 7581025213232055081, guid: e822dc5ea4d208e439e360c3cceec7a1, type: 3}
      propertyPath: m_LocalRotation.w
      value: 1
      objectReference: {fileID: 0}
    - target: {fileID: 7581025213232055081, guid: e822dc5ea4d208e439e360c3cceec7a1, type: 3}
      propertyPath: m_LocalRotation.x
      value: -0
      objectReference: {fileID: 0}
    - target: {fileID: 7581025213232055081, guid: e822dc5ea4d208e439e360c3cceec7a1, type: 3}
      propertyPath: m_LocalRotation.y
      value: -0
      objectReference: {fileID: 0}
    - target: {fileID: 7581025213232055081, guid: e822dc5ea4d208e439e360c3cceec7a1, type: 3}
      propertyPath: m_LocalRotation.z
      value: -0
      objectReference: {fileID: 0}
    - target: {fileID: 7581025213232055081, guid: e822dc5ea4d208e439e360c3cceec7a1, type: 3}
      propertyPath: m_LocalEulerAnglesHint.x
      value: 0
      objectReference: {fileID: 0}
    - target: {fileID: 7581025213232055081, guid: e822dc5ea4d208e439e360c3cceec7a1, type: 3}
      propertyPath: m_LocalEulerAnglesHint.y
      value: 0
      objectReference: {fileID: 0}
    - target: {fileID: 7581025213232055081, guid: e822dc5ea4d208e439e360c3cceec7a1, type: 3}
      propertyPath: m_LocalEulerAnglesHint.z
      value: 0
      objectReference: {fileID: 0}
    m_RemovedComponents: []
    m_RemovedGameObjects: []
    m_AddedGameObjects: []
    m_AddedComponents: []
  m_SourcePrefab: {fileID: 100100000, guid: e822dc5ea4d208e439e360c3cceec7a1, type: 3}
--- !u!4 &7297065346286048120 stripped
Transform:
  m_CorrespondingSourceObject: {fileID: 7581025213232055081, guid: e822dc5ea4d208e439e360c3cceec7a1, type: 3}
  m_PrefabInstance: {fileID: 896590188519313489}
  m_PrefabAsset: {fileID: 0}
--- !u!1001 &8267951630260794400
PrefabInstance:
  m_ObjectHideFlags: 0
  serializedVersion: 2
  m_Modification:
    serializedVersion: 3
    m_TransformParent: {fileID: 5729075165928102152}
    m_Modifications:
    - target: {fileID: -8679921383154817045, guid: 27afd3324360c964b8c60ae9a9caeec6, type: 3}
      propertyPath: m_LocalScale.x
      value: 1.5
      objectReference: {fileID: 0}
    - target: {fileID: -8679921383154817045, guid: 27afd3324360c964b8c60ae9a9caeec6, type: 3}
      propertyPath: m_LocalScale.y
      value: 1.5000001
      objectReference: {fileID: 0}
    - target: {fileID: -8679921383154817045, guid: 27afd3324360c964b8c60ae9a9caeec6, type: 3}
      propertyPath: m_LocalScale.z
      value: 1.5000001
      objectReference: {fileID: 0}
    - target: {fileID: -8679921383154817045, guid: 27afd3324360c964b8c60ae9a9caeec6, type: 3}
      propertyPath: m_LocalPosition.x
      value: 0
      objectReference: {fileID: 0}
    - target: {fileID: -8679921383154817045, guid: 27afd3324360c964b8c60ae9a9caeec6, type: 3}
      propertyPath: m_LocalPosition.y
      value: 0
      objectReference: {fileID: 0}
    - target: {fileID: -8679921383154817045, guid: 27afd3324360c964b8c60ae9a9caeec6, type: 3}
      propertyPath: m_LocalPosition.z
      value: 0
      objectReference: {fileID: 0}
    - target: {fileID: -8679921383154817045, guid: 27afd3324360c964b8c60ae9a9caeec6, type: 3}
      propertyPath: m_LocalRotation.w
      value: 0.7071068
      objectReference: {fileID: 0}
    - target: {fileID: -8679921383154817045, guid: 27afd3324360c964b8c60ae9a9caeec6, type: 3}
      propertyPath: m_LocalRotation.x
      value: -0.7071068
      objectReference: {fileID: 0}
    - target: {fileID: -8679921383154817045, guid: 27afd3324360c964b8c60ae9a9caeec6, type: 3}
      propertyPath: m_LocalRotation.y
      value: -0
      objectReference: {fileID: 0}
    - target: {fileID: -8679921383154817045, guid: 27afd3324360c964b8c60ae9a9caeec6, type: 3}
      propertyPath: m_LocalRotation.z
      value: -0
      objectReference: {fileID: 0}
    - target: {fileID: -8679921383154817045, guid: 27afd3324360c964b8c60ae9a9caeec6, type: 3}
      propertyPath: m_LocalEulerAnglesHint.x
      value: 0
      objectReference: {fileID: 0}
    - target: {fileID: -8679921383154817045, guid: 27afd3324360c964b8c60ae9a9caeec6, type: 3}
      propertyPath: m_LocalEulerAnglesHint.y
      value: 0
      objectReference: {fileID: 0}
    - target: {fileID: -8679921383154817045, guid: 27afd3324360c964b8c60ae9a9caeec6, type: 3}
      propertyPath: m_LocalEulerAnglesHint.z
      value: 0
      objectReference: {fileID: 0}
    - target: {fileID: 919132149155446097, guid: 27afd3324360c964b8c60ae9a9caeec6, type: 3}
      propertyPath: m_Name
      value: Dungeon_Wall_Hole_2
      objectReference: {fileID: 0}
    m_RemovedComponents: []
    m_RemovedGameObjects: []
    m_AddedGameObjects: []
    m_AddedComponents:
    - targetCorrespondingSourceObject: {fileID: 919132149155446097, guid: 27afd3324360c964b8c60ae9a9caeec6, type: 3}
      insertIndex: -1
      addedObject: {fileID: 2125040800580596839}
    - targetCorrespondingSourceObject: {fileID: 919132149155446097, guid: 27afd3324360c964b8c60ae9a9caeec6, type: 3}
      insertIndex: -1
      addedObject: {fileID: 392951064751155694}
  m_SourcePrefab: {fileID: 100100000, guid: 27afd3324360c964b8c60ae9a9caeec6, type: 3}
--- !u!4 &8446240855029912523 stripped
Transform:
  m_CorrespondingSourceObject: {fileID: -8679921383154817045, guid: 27afd3324360c964b8c60ae9a9caeec6, type: 3}
  m_PrefabInstance: {fileID: 8267951630260794400}
  m_PrefabAsset: {fileID: 0}
--- !u!1 &9114375121887512945 stripped
GameObject:
  m_CorrespondingSourceObject: {fileID: 919132149155446097, guid: 27afd3324360c964b8c60ae9a9caeec6, type: 3}
  m_PrefabInstance: {fileID: 8267951630260794400}
  m_PrefabAsset: {fileID: 0}
--- !u!65 &2125040800580596839
BoxCollider:
  m_ObjectHideFlags: 0
  m_CorrespondingSourceObject: {fileID: 0}
  m_PrefabInstance: {fileID: 0}
  m_PrefabAsset: {fileID: 0}
  m_GameObject: {fileID: 9114375121887512945}
  m_Material: {fileID: 0}
  m_IncludeLayers:
    serializedVersion: 2
    m_Bits: 0
  m_ExcludeLayers:
    serializedVersion: 2
    m_Bits: 0
  m_LayerOverridePriority: 0
  m_IsTrigger: 0
  m_ProvidesContacts: 0
  m_Enabled: 1
  serializedVersion: 3
  m_Size: {x: 1.946422, y: 1.9999998, z: 1}
  m_Center: {x: -0.02678901, y: 0, z: 3.5}
--- !u!64 &392951064751155694
MeshCollider:
  m_ObjectHideFlags: 0
  m_CorrespondingSourceObject: {fileID: 0}
  m_PrefabInstance: {fileID: 0}
  m_PrefabAsset: {fileID: 0}
  m_GameObject: {fileID: 9114375121887512945}
  m_Material: {fileID: 0}
  m_IncludeLayers:
    serializedVersion: 2
    m_Bits: 0
  m_ExcludeLayers:
    serializedVersion: 2
    m_Bits: 0
  m_LayerOverridePriority: 0
  m_IsTrigger: 0
  m_ProvidesContacts: 0
  m_Enabled: 1
  serializedVersion: 5
  m_Convex: 0
  m_CookingOptions: 30
  m_Mesh: {fileID: -2730878162672075481, guid: 27afd3324360c964b8c60ae9a9caeec6, type: 3}
