%YAML 1.1
%TAG !u! tag:unity3d.com,2011:
--- !u!114 &11400000
MonoBehaviour:
  m_ObjectHideFlags: 0
  m_CorrespondingSourceObject: {fileID: 0}
  m_PrefabInstance: {fileID: 0}
  m_PrefabAsset: {fileID: 0}
  m_GameObject: {fileID: 0}
  m_Enabled: 1
  m_EditorHideFlags: 0
  m_Script: {fileID: 11500000, guid: 7b7da937c7614f54185f66f0a0dbf4b7, type: 3}
  m_Name: page_tutorial_1
  m_EditorClassIdentifier: 
  index: 0
  leftPage: "<b>Day 378</b>\n\n I have one Spell Shape so far, but it is very underwhelming.
    I have been moving my hands about like a mad man to make the calliper move, but
    going forwards, I think I should  just\n   <font=\"Quikhand SDF\"><align=\"center\"><color=red>PRESS
    AND HOLD RIGHT CLICK<size=2em><size=1em> TO SUMMON THE SPELL SHAPE MENU, THEN
    DRAW A SPELL SHAPE.\n</font></color><align=\"right\"><size=1em><align=\"center\"><size=10em><sprite=\"spellcast\"
    index=0>\n\r\n\r"
  rightPage: "The spell suspension holds the fire in place really well, but this
    shape is rather weak. And yet, it can still do serious damage, like to this poor
    <color=red>HEDGE</color>! I used a dismiss hand motion to release the spell stasis,
    but I should design it so you can \n<color=red><font=\"Quikhand SDF\">PRESS LEFT
    MOUSE  <size=2em><size=1em>TO RELEASE THE SPELL.</font></color> \n</font></color><align=\"center\"><size=10em><sprite=\"spellrect\"
    index=0><align=\"left\"><size=1em>\nOf course, that is while using the Fire Crystal
    Heart. If I use a different one, the element of my spell changes, while maintaning
    the same shape.\n\n\n"
