%YAML 1.1
%TAG !u! tag:unity3d.com,2011:
--- !u!1001 &6123945620310155794
PrefabInstance:
  m_ObjectHideFlags: 0
  serializedVersion: 2
  m_Modification:
    serializedVersion: 3
    m_TransformParent: {fileID: 0}
    m_Modifications:
    - target: {fileID: -8679921383154817045, guid: b940b2e4ae2ba3741a4f179824d36b12, type: 3}
      propertyPath: m_LocalPosition.x
      value: 24.120083
      objectReference: {fileID: 0}
    - target: {fileID: -8679921383154817045, guid: b940b2e4ae2ba3741a4f179824d36b12, type: 3}
      propertyPath: m_LocalPosition.y
      value: 0
      objectReference: {fileID: 0}
    - target: {fileID: -8679921383154817045, guid: b940b2e4ae2ba3741a4f179824d36b12, type: 3}
      propertyPath: m_LocalPosition.z
      value: -16.545692
      objectReference: {fileID: 0}
    - target: {fileID: -8679921383154817045, guid: b940b2e4ae2ba3741a4f179824d36b12, type: 3}
      propertyPath: m_LocalRotation.w
      value: 0.7071067
      objectReference: {fileID: 0}
    - target: {fileID: -8679921383154817045, guid: b940b2e4ae2ba3741a4f179824d36b12, type: 3}
      propertyPath: m_LocalRotation.x
      value: -0.7071068
      objectReference: {fileID: 0}
    - target: {fileID: -8679921383154817045, guid: b940b2e4ae2ba3741a4f179824d36b12, type: 3}
      propertyPath: m_LocalRotation.y
      value: 0
      objectReference: {fileID: 0}
    - target: {fileID: -8679921383154817045, guid: b940b2e4ae2ba3741a4f179824d36b12, type: 3}
      propertyPath: m_LocalRotation.z
      value: -0
      objectReference: {fileID: 0}
    - target: {fileID: -8679921383154817045, guid: b940b2e4ae2ba3741a4f179824d36b12, type: 3}
      propertyPath: m_LocalEulerAnglesHint.x
      value: 0
      objectReference: {fileID: 0}
    - target: {fileID: -8679921383154817045, guid: b940b2e4ae2ba3741a4f179824d36b12, type: 3}
      propertyPath: m_LocalEulerAnglesHint.y
      value: 0
      objectReference: {fileID: 0}
    - target: {fileID: -8679921383154817045, guid: b940b2e4ae2ba3741a4f179824d36b12, type: 3}
      propertyPath: m_LocalEulerAnglesHint.z
      value: 0
      objectReference: {fileID: 0}
    - target: {fileID: 919132149155446097, guid: b940b2e4ae2ba3741a4f179824d36b12, type: 3}
      propertyPath: m_Name
      value: Fence_Post
      objectReference: {fileID: 0}
    m_RemovedComponents: []
    m_RemovedGameObjects: []
    m_AddedGameObjects: []
    m_AddedComponents:
    - targetCorrespondingSourceObject: {fileID: 919132149155446097, guid: b940b2e4ae2ba3741a4f179824d36b12, type: 3}
      insertIndex: -1
      addedObject: {fileID: 1843305584546651148}
  m_SourcePrefab: {fileID: 100100000, guid: b940b2e4ae2ba3741a4f179824d36b12, type: 3}
--- !u!1 &6358460116700258115 stripped
GameObject:
  m_CorrespondingSourceObject: {fileID: 919132149155446097, guid: b940b2e4ae2ba3741a4f179824d36b12, type: 3}
  m_PrefabInstance: {fileID: 6123945620310155794}
  m_PrefabAsset: {fileID: 0}
--- !u!65 &1843305584546651148
BoxCollider:
  m_ObjectHideFlags: 0
  m_CorrespondingSourceObject: {fileID: 0}
  m_PrefabInstance: {fileID: 0}
  m_PrefabAsset: {fileID: 0}
  m_GameObject: {fileID: 6358460116700258115}
  m_Material: {fileID: 0}
  m_IncludeLayers:
    serializedVersion: 2
    m_Bits: 0
  m_ExcludeLayers:
    serializedVersion: 2
    m_Bits: 0
  m_LayerOverridePriority: 0
  m_IsTrigger: 0
  m_ProvidesContacts: 0
  m_Enabled: 1
  serializedVersion: 3
  m_Size: {x: 0.13231143, y: 0.13231143, z: 1.0916257}
  m_Center: {x: 0.0000046752393, y: 0, z: 0.51519144}
