%YAML 1.1
%TAG !u! tag:unity3d.com,2011:
--- !u!114 &11400000
MonoBehaviour:
  m_ObjectHideFlags: 0
  m_CorrespondingSourceObject: {fileID: 0}
  m_PrefabInstance: {fileID: 0}
  m_PrefabAsset: {fileID: 0}
  m_GameObject: {fileID: 0}
  m_Enabled: 1
  m_EditorHideFlags: 0
  m_Script: {fileID: 11500000, guid: 2603c7076bf0e394b9569487d03a66ee, type: 3}
  m_Name: WaterData
  m_EditorClassIdentifier: 
  meeneeElement: Water
  speed: 4
  runSpeed: 9
  flyingSpeed: 0
  talkingSpeed: 1.2
  talkingPitch: 0.9
  maxEnergy: 140
  maxPlayfulness: 185
  whatIsInteractable:
    serializedVersion: 2
    m_Bits: 4352
