%YAML 1.1
%TAG !u! tag:unity3d.com,2011:
--- !u!1001 &6827908691620372559
PrefabInstance:
  m_ObjectHideFlags: 0
  serializedVersion: 2
  m_Modification:
    serializedVersion: 3
    m_TransformParent: {fileID: 0}
    m_Modifications:
    - target: {fileID: -8679921383154817045, guid: 49c3552458f5fb94897396d6a1f9f111, type: 3}
      propertyPath: m_LocalPosition.x
      value: 1.9551048
      objectReference: {fileID: 0}
    - target: {fileID: -8679921383154817045, guid: 49c3552458f5fb94897396d6a1f9f111, type: 3}
      propertyPath: m_LocalPosition.y
      value: 0
      objectReference: {fileID: 0}
    - target: {fileID: -8679921383154817045, guid: 49c3552458f5fb94897396d6a1f9f111, type: 3}
      propertyPath: m_LocalPosition.z
      value: -1.4841995
      objectReference: {fileID: 0}
    - target: {fileID: -8679921383154817045, guid: 49c3552458f5fb94897396d6a1f9f111, type: 3}
      propertyPath: m_LocalRotation.w
      value: 1
      objectReference: {fileID: 0}
    - target: {fileID: -8679921383154817045, guid: 49c3552458f5fb94897396d6a1f9f111, type: 3}
      propertyPath: m_LocalRotation.x
      value: -0
      objectReference: {fileID: 0}
    - target: {fileID: -8679921383154817045, guid: 49c3552458f5fb94897396d6a1f9f111, type: 3}
      propertyPath: m_LocalRotation.y
      value: -0
      objectReference: {fileID: 0}
    - target: {fileID: -8679921383154817045, guid: 49c3552458f5fb94897396d6a1f9f111, type: 3}
      propertyPath: m_LocalRotation.z
      value: -0
      objectReference: {fileID: 0}
    - target: {fileID: -8679921383154817045, guid: 49c3552458f5fb94897396d6a1f9f111, type: 3}
      propertyPath: m_LocalEulerAnglesHint.x
      value: 0
      objectReference: {fileID: 0}
    - target: {fileID: -8679921383154817045, guid: 49c3552458f5fb94897396d6a1f9f111, type: 3}
      propertyPath: m_LocalEulerAnglesHint.y
      value: 0
      objectReference: {fileID: 0}
    - target: {fileID: -8679921383154817045, guid: 49c3552458f5fb94897396d6a1f9f111, type: 3}
      propertyPath: m_LocalEulerAnglesHint.z
      value: 0
      objectReference: {fileID: 0}
    - target: {fileID: -7511558181221131132, guid: 49c3552458f5fb94897396d6a1f9f111, type: 3}
      propertyPath: m_Materials.Array.data[0]
      value: 
      objectReference: {fileID: 2100000, guid: 2beb888046897c44db8967abf9d24435, type: 2}
    - target: {fileID: 919132149155446097, guid: 49c3552458f5fb94897396d6a1f9f111, type: 3}
      propertyPath: m_Name
      value: Candle_Holder
      objectReference: {fileID: 0}
    m_RemovedComponents: []
    m_RemovedGameObjects: []
    m_AddedGameObjects: []
    m_AddedComponents: []
  m_SourcePrefab: {fileID: 100100000, guid: 49c3552458f5fb94897396d6a1f9f111, type: 3}
