%YAML 1.1
%TAG !u! tag:unity3d.com,2011:
--- !u!1001 &6035977800586342062
PrefabInstance:
  m_ObjectHideFlags: 0
  serializedVersion: 2
  m_Modification:
    serializedVersion: 3
    m_TransformParent: {fileID: 0}
    m_Modifications:
    - target: {fileID: -8679921383154817045, guid: 2c5bef32db01a4547a9a4bb2856615bc, type: 3}
      propertyPath: m_LocalPosition.x
      value: 28.236475
      objectReference: {fileID: 0}
    - target: {fileID: -8679921383154817045, guid: 2c5bef32db01a4547a9a4bb2856615bc, type: 3}
      propertyPath: m_LocalPosition.y
      value: 0
      objectReference: {fileID: 0}
    - target: {fileID: -8679921383154817045, guid: 2c5bef32db01a4547a9a4bb2856615bc, type: 3}
      propertyPath: m_LocalPosition.z
      value: -16.579334
      objectReference: {fileID: 0}
    - target: {fileID: -8679921383154817045, guid: 2c5bef32db01a4547a9a4bb2856615bc, type: 3}
      propertyPath: m_LocalRotation.w
      value: 0.7071067
      objectReference: {fileID: 0}
    - target: {fileID: -8679921383154817045, guid: 2c5bef32db01a4547a9a4bb2856615bc, type: 3}
      propertyPath: m_LocalRotation.x
      value: -0.7071068
      objectReference: {fileID: 0}
    - target: {fileID: -8679921383154817045, guid: 2c5bef32db01a4547a9a4bb2856615bc, type: 3}
      propertyPath: m_LocalRotation.y
      value: 0
      objectReference: {fileID: 0}
    - target: {fileID: -8679921383154817045, guid: 2c5bef32db01a4547a9a4bb2856615bc, type: 3}
      propertyPath: m_LocalRotation.z
      value: -0
      objectReference: {fileID: 0}
    - target: {fileID: -8679921383154817045, guid: 2c5bef32db01a4547a9a4bb2856615bc, type: 3}
      propertyPath: m_LocalEulerAnglesHint.x
      value: 0
      objectReference: {fileID: 0}
    - target: {fileID: -8679921383154817045, guid: 2c5bef32db01a4547a9a4bb2856615bc, type: 3}
      propertyPath: m_LocalEulerAnglesHint.y
      value: 0
      objectReference: {fileID: 0}
    - target: {fileID: -8679921383154817045, guid: 2c5bef32db01a4547a9a4bb2856615bc, type: 3}
      propertyPath: m_LocalEulerAnglesHint.z
      value: 0
      objectReference: {fileID: 0}
    - target: {fileID: 919132149155446097, guid: 2c5bef32db01a4547a9a4bb2856615bc, type: 3}
      propertyPath: m_Name
      value: Lantern_Hanging_Post
      objectReference: {fileID: 0}
    m_RemovedComponents: []
    m_RemovedGameObjects: []
    m_AddedGameObjects: []
    m_AddedComponents:
    - targetCorrespondingSourceObject: {fileID: 919132149155446097, guid: 2c5bef32db01a4547a9a4bb2856615bc, type: 3}
      insertIndex: -1
      addedObject: {fileID: 4291959042451417083}
  m_SourcePrefab: {fileID: 100100000, guid: 2c5bef32db01a4547a9a4bb2856615bc, type: 3}
--- !u!1 &6847001977413080063 stripped
GameObject:
  m_CorrespondingSourceObject: {fileID: 919132149155446097, guid: 2c5bef32db01a4547a9a4bb2856615bc, type: 3}
  m_PrefabInstance: {fileID: 6035977800586342062}
  m_PrefabAsset: {fileID: 0}
--- !u!65 &4291959042451417083
BoxCollider:
  m_ObjectHideFlags: 0
  m_CorrespondingSourceObject: {fileID: 0}
  m_PrefabInstance: {fileID: 0}
  m_PrefabAsset: {fileID: 0}
  m_GameObject: {fileID: 6847001977413080063}
  m_Material: {fileID: 0}
  m_IncludeLayers:
    serializedVersion: 2
    m_Bits: 0
  m_ExcludeLayers:
    serializedVersion: 2
    m_Bits: 0
  m_LayerOverridePriority: 0
  m_IsTrigger: 0
  m_ProvidesContacts: 0
  m_Enabled: 1
  serializedVersion: 3
  m_Size: {x: 0.10232544, y: 0.52196306, z: 0.37798184}
  m_Center: {x: 0.0010375977, y: -0.20029351, z: 0.0000137090665}
