%YAML 1.1
%TAG !u! tag:unity3d.com,2011:
--- !u!114 &11400000
MonoBehaviour:
  m_ObjectHideFlags: 0
  m_CorrespondingSourceObject: {fileID: 0}
  m_PrefabInstance: {fileID: 0}
  m_PrefabAsset: {fileID: 0}
  m_GameObject: {fileID: 0}
  m_Enabled: 1
  m_EditorHideFlags: 0
  m_Script: {fileID: 11500000, guid: 2603c7076bf0e394b9569487d03a66ee, type: 3}
  m_Name: FireData
  m_EditorClassIdentifier: 
  meeneeElement: Fire
  speed: 5
  runSpeed: 12
  flyingSpeed: 6
  talkingSpeed: 2
  talkingPitch: 1.3
  maxEnergy: 100
  maxPlayfulness: 200
  whatIsInteractable:
    serializedVersion: 2
    m_Bits: 4352
