%YAML 1.1
%TAG !u! tag:unity3d.com,2011:
--- !u!1001 &3495745432603783336
PrefabInstance:
  m_ObjectHideFlags: 0
  serializedVersion: 2
  m_Modification:
    serializedVersion: 3
    m_TransformParent: {fileID: 0}
    m_Modifications:
    - target: {fileID: -8679921383154817045, guid: 5e49f936d6b3689458832f1b721da150, type: 3}
      propertyPath: m_LocalPosition.x
      value: 21.203392
      objectReference: {fileID: 0}
    - target: {fileID: -8679921383154817045, guid: 5e49f936d6b3689458832f1b721da150, type: 3}
      propertyPath: m_LocalPosition.y
      value: 0
      objectReference: {fileID: 0}
    - target: {fileID: -8679921383154817045, guid: 5e49f936d6b3689458832f1b721da150, type: 3}
      propertyPath: m_LocalPosition.z
      value: -17.90125
      objectReference: {fileID: 0}
    - target: {fileID: -8679921383154817045, guid: 5e49f936d6b3689458832f1b721da150, type: 3}
      propertyPath: m_LocalRotation.w
      value: 0.7071067
      objectReference: {fileID: 0}
    - target: {fileID: -8679921383154817045, guid: 5e49f936d6b3689458832f1b721da150, type: 3}
      propertyPath: m_LocalRotation.x
      value: -0.7071068
      objectReference: {fileID: 0}
    - target: {fileID: -8679921383154817045, guid: 5e49f936d6b3689458832f1b721da150, type: 3}
      propertyPath: m_LocalRotation.y
      value: 0
      objectReference: {fileID: 0}
    - target: {fileID: -8679921383154817045, guid: 5e49f936d6b3689458832f1b721da150, type: 3}
      propertyPath: m_LocalRotation.z
      value: -0
      objectReference: {fileID: 0}
    - target: {fileID: -8679921383154817045, guid: 5e49f936d6b3689458832f1b721da150, type: 3}
      propertyPath: m_LocalEulerAnglesHint.x
      value: 0
      objectReference: {fileID: 0}
    - target: {fileID: -8679921383154817045, guid: 5e49f936d6b3689458832f1b721da150, type: 3}
      propertyPath: m_LocalEulerAnglesHint.y
      value: 0
      objectReference: {fileID: 0}
    - target: {fileID: -8679921383154817045, guid: 5e49f936d6b3689458832f1b721da150, type: 3}
      propertyPath: m_LocalEulerAnglesHint.z
      value: 0
      objectReference: {fileID: 0}
    - target: {fileID: 919132149155446097, guid: 5e49f936d6b3689458832f1b721da150, type: 3}
      propertyPath: m_Name
      value: Small_Tree_1
      objectReference: {fileID: 0}
    - target: {fileID: 919132149155446097, guid: 5e49f936d6b3689458832f1b721da150, type: 3}
      propertyPath: m_TagString
      value: FireDestroy
      objectReference: {fileID: 0}
    m_RemovedComponents: []
    m_RemovedGameObjects: []
    m_AddedGameObjects: []
    m_AddedComponents:
    - targetCorrespondingSourceObject: {fileID: 919132149155446097, guid: 5e49f936d6b3689458832f1b721da150, type: 3}
      insertIndex: -1
      addedObject: {fileID: 5551795050538896580}
  m_SourcePrefab: {fileID: 100100000, guid: 5e49f936d6b3689458832f1b721da150, type: 3}
--- !u!1 &4342041937080471033 stripped
GameObject:
  m_CorrespondingSourceObject: {fileID: 919132149155446097, guid: 5e49f936d6b3689458832f1b721da150, type: 3}
  m_PrefabInstance: {fileID: 3495745432603783336}
  m_PrefabAsset: {fileID: 0}
--- !u!65 &5551795050538896580
BoxCollider:
  m_ObjectHideFlags: 0
  m_CorrespondingSourceObject: {fileID: 0}
  m_PrefabInstance: {fileID: 0}
  m_PrefabAsset: {fileID: 0}
  m_GameObject: {fileID: 4342041937080471033}
  m_Material: {fileID: 0}
  m_IncludeLayers:
    serializedVersion: 2
    m_Bits: 0
  m_ExcludeLayers:
    serializedVersion: 2
    m_Bits: 0
  m_LayerOverridePriority: 0
  m_IsTrigger: 0
  m_ProvidesContacts: 0
  m_Enabled: 1
  serializedVersion: 3
  m_Size: {x: 1.3011379, y: 1.4418014, z: 2.074238}
  m_Center: {x: -0.032809258, y: 0.018950613, z: 0.9767748}
