%YAML 1.1
%TAG !u! tag:unity3d.com,2011:
--- !u!1001 &5088993031770128587
PrefabInstance:
  m_ObjectHideFlags: 0
  serializedVersion: 2
  m_Modification:
    serializedVersion: 3
    m_TransformParent: {fileID: 0}
    m_Modifications:
    - target: {fileID: 1464665866763103857, guid: 21999d17446741215a43775fbc2437e2, type: 3}
      propertyPath: illegal
      value: 1
      objectReference: {fileID: 0}
    - target: {fileID: 1464665866763103857, guid: 21999d17446741215a43775fbc2437e2, type: 3}
      propertyPath: registered
      value: 1
      objectReference: {fileID: 0}
    - target: {fileID: 1464665866763103857, guid: 21999d17446741215a43775fbc2437e2, type: 3}
      propertyPath: unique_dialogue_json
      value: 
      objectReference: {fileID: 4900000, guid: 8e9b3c8604d52436ab348305d146d64a, type: 3}
    - target: {fileID: 3019343727235298346, guid: 21999d17446741215a43775fbc2437e2, type: 3}
      propertyPath: m_audioClip
      value: 
      objectReference: {fileID: 8300000, guid: fa13837fff4e9a81eb170f98fbbe0280, type: 3}
    - target: {fileID: 3946586912616826713, guid: 21999d17446741215a43775fbc2437e2, type: 3}
      propertyPath: m_LocalPosition.x
      value: 0
      objectReference: {fileID: 0}
    - target: {fileID: 3946586912616826713, guid: 21999d17446741215a43775fbc2437e2, type: 3}
      propertyPath: m_LocalPosition.y
      value: 0
      objectReference: {fileID: 0}
    - target: {fileID: 3946586912616826713, guid: 21999d17446741215a43775fbc2437e2, type: 3}
      propertyPath: m_LocalPosition.z
      value: 0
      objectReference: {fileID: 0}
    - target: {fileID: 3946586912616826713, guid: 21999d17446741215a43775fbc2437e2, type: 3}
      propertyPath: m_LocalRotation.w
      value: 1
      objectReference: {fileID: 0}
    - target: {fileID: 3946586912616826713, guid: 21999d17446741215a43775fbc2437e2, type: 3}
      propertyPath: m_LocalRotation.x
      value: 0
      objectReference: {fileID: 0}
    - target: {fileID: 3946586912616826713, guid: 21999d17446741215a43775fbc2437e2, type: 3}
      propertyPath: m_LocalRotation.y
      value: 0
      objectReference: {fileID: 0}
    - target: {fileID: 3946586912616826713, guid: 21999d17446741215a43775fbc2437e2, type: 3}
      propertyPath: m_LocalRotation.z
      value: 0
      objectReference: {fileID: 0}
    - target: {fileID: 3946586912616826713, guid: 21999d17446741215a43775fbc2437e2, type: 3}
      propertyPath: m_LocalEulerAnglesHint.x
      value: 0
      objectReference: {fileID: 0}
    - target: {fileID: 3946586912616826713, guid: 21999d17446741215a43775fbc2437e2, type: 3}
      propertyPath: m_LocalEulerAnglesHint.y
      value: 0
      objectReference: {fileID: 0}
    - target: {fileID: 3946586912616826713, guid: 21999d17446741215a43775fbc2437e2, type: 3}
      propertyPath: m_LocalEulerAnglesHint.z
      value: 0
      objectReference: {fileID: 0}
    - target: {fileID: 4944688088244803840, guid: 21999d17446741215a43775fbc2437e2, type: 3}
      propertyPath: m_Name
      value: BombExpert
      objectReference: {fileID: 0}
    - target: {fileID: 8983694378371703269, guid: 21999d17446741215a43775fbc2437e2, type: 3}
      propertyPath: m_Size.x
      value: 4.8
      objectReference: {fileID: 0}
    - target: {fileID: 8983694378371703269, guid: 21999d17446741215a43775fbc2437e2, type: 3}
      propertyPath: m_Size.y
      value: 4.8
      objectReference: {fileID: 0}
    - target: {fileID: 8983694378371703269, guid: 21999d17446741215a43775fbc2437e2, type: 3}
      propertyPath: m_Sprite
      value: 
      objectReference: {fileID: 21300000, guid: 380dfe9dbbf74334db798bf63b8412d6, type: 3}
    - target: {fileID: 8983694378371703269, guid: 21999d17446741215a43775fbc2437e2, type: 3}
      propertyPath: m_WasSpriteAssigned
      value: 1
      objectReference: {fileID: 0}
    m_RemovedComponents: []
    m_RemovedGameObjects: []
    m_AddedGameObjects: []
    m_AddedComponents: []
  m_SourcePrefab: {fileID: 100100000, guid: 21999d17446741215a43775fbc2437e2, type: 3}
