%YAML 1.1
%TAG !u! tag:unity3d.com,2011:
--- !u!114 &11400000
MonoBehaviour:
  m_ObjectHideFlags: 0
  m_CorrespondingSourceObject: {fileID: 0}
  m_PrefabInstance: {fileID: 0}
  m_PrefabAsset: {fileID: 0}
  m_GameObject: {fileID: 0}
  m_Enabled: 1
  m_EditorHideFlags: 0
  m_Script: {fileID: 11500000, guid: 101efb3a120cae979b942f272b5a8111, type: 3}
  m_Name: New CoS
  m_EditorClassIdentifier: 
  prefab: {fileID: 4517237328351796048, guid: 75a881274d975f23abbdf34fc52732ee, type: 3}
  spawn: {fileID: 0}
  game_object: {fileID: 0}
  photo: {fileID: 0}
  person: {fileID: 1740238127632170845, guid: be09de9f348115b5fb0557e32a2e8879, type: 3}
  name: "Ji\u0159i Houdek"
  id: F4K3-4FFR
  school: "\u010CVUT FIT"
  expiration: 12. 12. 2026
  fakeStamp: 0
