%YAML 1.1
%TAG !u! tag:unity3d.com,2011:
--- !u!1001 &7340516116084306894
PrefabInstance:
  m_ObjectHideFlags: 0
  serializedVersion: 2
  m_Modification:
    serializedVersion: 3
    m_TransformParent: {fileID: 0}
    m_Modifications:
    - target: {fileID: 2128681516595951560, guid: 850d3005b194a56ec8e20e4d177dd45e, type: 3}
      propertyPath: m_Enabled
      value: 0
      objectReference: {fileID: 0}
    - target: {fileID: 2170703320069990149, guid: 850d3005b194a56ec8e20e4d177dd45e, type: 3}
      propertyPath: m_text
      value: 1 2 3 4
      objectReference: {fileID: 0}
    - target: {fileID: 2170703320069990149, guid: 850d3005b194a56ec8e20e4d177dd45e, type: 3}
      propertyPath: m_fontSize
      value: 0.4
      objectReference: {fileID: 0}
    - target: {fileID: 2170703320069990149, guid: 850d3005b194a56ec8e20e4d177dd45e, type: 3}
      propertyPath: m_VerticalAlignment
      value: 512
      objectReference: {fileID: 0}
    - target: {fileID: 2170703320069990149, guid: 850d3005b194a56ec8e20e4d177dd45e, type: 3}
      propertyPath: m_HorizontalAlignment
      value: 2
      objectReference: {fileID: 0}
    - target: {fileID: 4517237328351796048, guid: 850d3005b194a56ec8e20e4d177dd45e, type: 3}
      propertyPath: m_Name
      value: BombDefuse
      objectReference: {fileID: 0}
    - target: {fileID: 6320128065676629005, guid: 850d3005b194a56ec8e20e4d177dd45e, type: 3}
      propertyPath: m_Enabled
      value: 0
      objectReference: {fileID: 0}
    - target: {fileID: 8192360999539371217, guid: 850d3005b194a56ec8e20e4d177dd45e, type: 3}
      propertyPath: m_LocalPosition.x
      value: 0
      objectReference: {fileID: 0}
    - target: {fileID: 8192360999539371217, guid: 850d3005b194a56ec8e20e4d177dd45e, type: 3}
      propertyPath: m_LocalPosition.y
      value: 0
      objectReference: {fileID: 0}
    - target: {fileID: 8192360999539371217, guid: 850d3005b194a56ec8e20e4d177dd45e, type: 3}
      propertyPath: m_LocalPosition.z
      value: 0
      objectReference: {fileID: 0}
    - target: {fileID: 8192360999539371217, guid: 850d3005b194a56ec8e20e4d177dd45e, type: 3}
      propertyPath: m_LocalRotation.w
      value: 1
      objectReference: {fileID: 0}
    - target: {fileID: 8192360999539371217, guid: 850d3005b194a56ec8e20e4d177dd45e, type: 3}
      propertyPath: m_LocalRotation.x
      value: 0
      objectReference: {fileID: 0}
    - target: {fileID: 8192360999539371217, guid: 850d3005b194a56ec8e20e4d177dd45e, type: 3}
      propertyPath: m_LocalRotation.y
      value: 0
      objectReference: {fileID: 0}
    - target: {fileID: 8192360999539371217, guid: 850d3005b194a56ec8e20e4d177dd45e, type: 3}
      propertyPath: m_LocalRotation.z
      value: 0
      objectReference: {fileID: 0}
    - target: {fileID: 8192360999539371217, guid: 850d3005b194a56ec8e20e4d177dd45e, type: 3}
      propertyPath: m_LocalEulerAnglesHint.x
      value: 0
      objectReference: {fileID: 0}
    - target: {fileID: 8192360999539371217, guid: 850d3005b194a56ec8e20e4d177dd45e, type: 3}
      propertyPath: m_LocalEulerAnglesHint.y
      value: 0
      objectReference: {fileID: 0}
    - target: {fileID: 8192360999539371217, guid: 850d3005b194a56ec8e20e4d177dd45e, type: 3}
      propertyPath: m_LocalEulerAnglesHint.z
      value: 0
      objectReference: {fileID: 0}
    m_RemovedComponents: []
    m_RemovedGameObjects: []
    m_AddedGameObjects: []
    m_AddedComponents: []
  m_SourcePrefab: {fileID: 100100000, guid: 850d3005b194a56ec8e20e4d177dd45e, type: 3}
