%YAML 1.1
%TAG !u! tag:unity3d.com,2011:
--- !u!1001 &5155566165065642452
PrefabInstance:
  m_ObjectHideFlags: 0
  serializedVersion: 2
  m_Modification:
    serializedVersion: 3
    m_TransformParent: {fileID: 0}
    m_Modifications:
    - target: {fileID: 1740238127632170845, guid: be09de9f348115b5fb0557e32a2e8879, type: 3}
      propertyPath: hasFake
      value: 0
      objectReference: {fileID: 0}
    - target: {fileID: 1740238127632170845, guid: be09de9f348115b5fb0557e32a2e8879, type: 3}
      propertyPath: illegal
      value: 0
      objectReference: {fileID: 0}
    - target: {fileID: 1740238127632170845, guid: be09de9f348115b5fb0557e32a2e8879, type: 3}
      propertyPath: documents.Array.data[0]
      value: 
      objectReference: {fileID: 11400000, guid: f7a0fd2491a2522d6a29904732d33a47, type: 2}
    - target: {fileID: 1740238127632170845, guid: be09de9f348115b5fb0557e32a2e8879, type: 3}
      propertyPath: documents.Array.data[1]
      value: 
      objectReference: {fileID: 11400000, guid: db4b689eb22fd104e9e7b028719ab11a, type: 2}
    - target: {fileID: 1740238127632170845, guid: be09de9f348115b5fb0557e32a2e8879, type: 3}
      propertyPath: documents.Array.data[2]
      value: 
      objectReference: {fileID: 11400000, guid: f2989a890f2958c94bfc41e82ff3f8c5, type: 2}
    - target: {fileID: 1740238127632170845, guid: be09de9f348115b5fb0557e32a2e8879, type: 3}
      propertyPath: paperLegality.has_fake_id
      value: 0
      objectReference: {fileID: 0}
    - target: {fileID: 4228896956043073141, guid: be09de9f348115b5fb0557e32a2e8879, type: 3}
      propertyPath: m_LocalPosition.x
      value: 0
      objectReference: {fileID: 0}
    - target: {fileID: 4228896956043073141, guid: be09de9f348115b5fb0557e32a2e8879, type: 3}
      propertyPath: m_LocalPosition.y
      value: 0
      objectReference: {fileID: 0}
    - target: {fileID: 4228896956043073141, guid: be09de9f348115b5fb0557e32a2e8879, type: 3}
      propertyPath: m_LocalPosition.z
      value: 0
      objectReference: {fileID: 0}
    - target: {fileID: 4228896956043073141, guid: be09de9f348115b5fb0557e32a2e8879, type: 3}
      propertyPath: m_LocalRotation.w
      value: 1
      objectReference: {fileID: 0}
    - target: {fileID: 4228896956043073141, guid: be09de9f348115b5fb0557e32a2e8879, type: 3}
      propertyPath: m_LocalRotation.x
      value: 0
      objectReference: {fileID: 0}
    - target: {fileID: 4228896956043073141, guid: be09de9f348115b5fb0557e32a2e8879, type: 3}
      propertyPath: m_LocalRotation.y
      value: 0
      objectReference: {fileID: 0}
    - target: {fileID: 4228896956043073141, guid: be09de9f348115b5fb0557e32a2e8879, type: 3}
      propertyPath: m_LocalRotation.z
      value: 0
      objectReference: {fileID: 0}
    - target: {fileID: 4228896956043073141, guid: be09de9f348115b5fb0557e32a2e8879, type: 3}
      propertyPath: m_LocalEulerAnglesHint.x
      value: 0
      objectReference: {fileID: 0}
    - target: {fileID: 4228896956043073141, guid: be09de9f348115b5fb0557e32a2e8879, type: 3}
      propertyPath: m_LocalEulerAnglesHint.y
      value: 0
      objectReference: {fileID: 0}
    - target: {fileID: 4228896956043073141, guid: be09de9f348115b5fb0557e32a2e8879, type: 3}
      propertyPath: m_LocalEulerAnglesHint.z
      value: 0
      objectReference: {fileID: 0}
    - target: {fileID: 5254037330246305836, guid: be09de9f348115b5fb0557e32a2e8879, type: 3}
      propertyPath: m_Name
      value: Skibidi
      objectReference: {fileID: 0}
    m_RemovedComponents: []
    m_RemovedGameObjects: []
    m_AddedGameObjects: []
    m_AddedComponents: []
  m_SourcePrefab: {fileID: 100100000, guid: be09de9f348115b5fb0557e32a2e8879, type: 3}
