{
    "cz": {
        "country": "Česká Republika",
        "nationality": "Czech",
        "skin_color_probability": {
            "white" : 4,
            "black" : 1,
            "middle_east" : 1,
            "asian" : 2
        },
        "names": {
            "male": {
                "first": [
                    "Alan", "Aleš", "Alexandr", "Alois", "Andrej", "Antonín", "Arnošt", "Artur", "Augustýn", "Bedřich", 
                    "Benedikt", "Blažej", "Bohdan", "Bohuslav", "Boleslav", "Bonifác", "Bořek", "Boris", "Bořivoj", 
                    "Břetislav", "Bronislav", "Bruno", "Čeněk", "Čestmír", "Ctibor", "Ctirad", "Dalimil", "Daniel", 
                    "Denis", "Dobroslav", "Dominik", "Drahoslav", "Emil", "Erik", "Ferdinand", "Filip", "František", 
                    "Hanuš", "Havel", "Herbert", "Herman", "Hugo", "Igor", "Ivan", "Ivo", "Jáchym", "Jakub", "Jarmil", 
                    "Jaromír", "Jaroslav", "Jiří", "Julius", "Kamil", "Kazimír", "Klement", "Kristián", "Kryštof", 
                    "Květoslav", "Kvido", "Ladislav", "Leopold", "Leoš", "Libor", "Lubor", "Luděk", "Lukáš", "Marcel", 
                    "Martin", "Matěj", "Matouš", "Maxmilián", "Medard", "Michal", "Miloš", "Miroslav", "Nikolas", 
                    "Oldřich", "Oleg", "Oliver", "Otakar", "Otmar", "Oto", "Pankrác", "Patrik", "Pravoslav", "Přemysl", 
                    "Prokop", "Radek", "Radim", "Radomír", "Radoslav", "Radovan", "Richard", "Robert", "Roland", 
                    "Roman", "Rostislav", "Samuel", "Sebastian", "Servác", "Stanislav", "Štefan", "Štěpán", "Svatopluk", 
                    "Teodor", "Tibor", "Tomáš", "Václav", "Valdemar", "Valentýn", "Vavřinec", "Věnceslav", "Vendelín", 
                    "Věroslav", "Viktor", "Vilém", "Vincenc", "Vladan", "Vladimír", "Vladislav", "Vlastislav", 
                    "Vojtěch", "Zbyšek", "Zdeněk"
                ],
                "last": [
                    "Adamec", "Bednář", "Beran", "Beránek", "Bílek", "Brabec", "Brotz", "Brož", "Bureš", "Burian", "Čech", "Čermák", 
                    "Charvát", "Čížek", "Dohnal", "Doležal", "Dušek", "Fišer", "Hájek", "Hanuš", "Haušild", "Havlík", "Hladík", 
                    "Hlaváč", "Holub", "Horák", "Horváth", "Hošek", "Janeček", "Jaroš", "Jeřábek", "Jílek", "Kašpar", "Klimeš", 
                    "Kočí", "Komárek", "Kořínek", "Kovařík", "Kozák", "Král", "Kratochvíl", "Kraus", "Krejčí", "Kříž", "Křoupal", 
                    "Kubát", "Kubíček", "Kučaj", "Linhart", "Mach", "Macháček", "Málek", "Marek", "Mašek", "Matoušek", "Mazal", 
                    "Michálek", "Mišalko", "Moravec", "Musil", "Navrátil", "Němec", "Němeček", "Nistor", "Nováček", "Novák", 
                    "Opustil", "Ošetřil", "Pešek", "Petr", "Pletánek", "Podlezl", "Polák", "Polášek", "Pospíchal", "Pospíšil", 
                    "Povýšil", "Přibyl", "Prokop", "Prusík", "Ptáček", "Řehák", "Řezníček", "Richter", "Rmoutil", "Rušil", "Rýpal", 
                    "Ševčík", "Šimek", "Sládek", "Slavík", "Slezák", "Šmíd", "Soukup", "Špaček", "Šrámek", "Stehlík", "Stejskal", 
                    "Štěpán", "Štěpánek", "Strnad", "Suchánek", "Šulc", "Švec", "Toman", "Tomášek", "Troufal", "Tureček", "Urbánek", 
                    "Utěkal", "Vaněk", "Vítek", "Vlček", "Volf", "Vykukal", "Zacpal", "Žák", "Zapletal", "Zdráhal", "Zeman", 
                    "Zmeškal", "Ztratil", "Zukal"
                ]
            },
            "female": {
                "first": [
                    "Adéla", "Adriana", "Albína", "Alice", "Alžběta", "Anastázie", "Anděla", "Anežka", "Anna", "Antonie", 
                    "Beáta", "Běla", "Berta", "Blanka", "Bohdana", "Bohuslava", "Božena", "Brigita", "Cecílie", "Daniela", 
                    "Darina", "Darja", "Dáša", "Denisa", "Diana", "Dita", "Dobromila", "Dorota", "Drahoslava", "Edita", 
                    "Eliška", "Ema", "Emílie", "Erika", "Ester", "Eva", "Evženie", "Františka", "Gita", "Gizela", "Hana", 
                    "Hedvika", "Helena", "Hermína", "Ida", "Ilona", "Iva", "Ivona", "Jana", "Jaroslava", "Jiřina", "Jitka", 
                    "Johana", "Jolana", "Judita", "Julie", "Justýna", "Karolína", "Klára", "Klaudie", "Kristýna", "Květa", 
                    "Lada", "Laura", "Lenka", "Liběna", "Libuše", "Liliana", "Linda", "Lucie", "Lucka", "Lýdie", "Magdaléna", 
                    "Mahulena", "Marcela", "Marie", "Marika", "Marta", "Martina", "Michaela", "Milena", "Miluše", "Miriam", 
                    "Miroslava", "Monika", "Naděžda", "Natálie", "Nela", "Nina", "Nora", "Oldřiška", "Olga", "Olívie", 
                    "Otýlie", "Patricie", "Pavla", "Pavlína", "Pavlíná", "Petra", "Radana", "Radmila", "Růžena", "Sandra", 
                    "Šárka", "Šarlota", "Saskie", "Silvie", "Simona", "Stanislava", "Stela", "Štěpánka", "Svatava", "Světlana", 
                    "Tamara", "Taťána", "Valérie", "Vanda", "Vendula", "Věra", "Veronika", "Vilma", "Vladěna", "Vlasta", 
                    "Xenie", "Žaneta", "Zdislava", "Zlata", "Zoe", "Žofie", "Zora", "Zuzana"
                ],
                "last": [
                    "Adamcová", "Adamová", "Bartíková", "Bartošová", "Benešová", "Beránková", "Bílková", "Bláhová", 
                    "Březinová", "Brožová", "Burianová", "Čapková", "Červenková", "Chalupová", "Charvátová", "Davidová", 
                    "Divišová", "Doležalová", "Dostálová", "Dušková", "Fišerová", "Francová", "Franková", "Hamplová", 
                    "Hanáková", "Haušildová", "Havlíčková", "Havlíková", "Hladíková", "Hlaváčková", "Hlaváčová", 
                    "Hofmanová", "Holečková", "Holubová", "Horáková", "Horváthová", "Hošková", "Janoušková", "Jarošová", 
                    "Jelínková", "Jeřábková", "Jirásková", "Kadlecová", "Kejsalová", "Klimešová", "Klímková", "Kociánová", 
                    "Kocourková", "Kočová", "Kolářová", "Konrádová", "Kopřivová", "Kořínková", "Kováčová", "Kovaříková", 
                    "Kozáková", "Králová", "Kratochvílová", "Krejčová", "Křivánková", "Kroupová", "Kubátová", "Kubíková", 
                    "Kučerová", "Loubalová", "Lukášová", "Málková", "Marečková", "Marešová", "Martinková", "Martínková", 
                    "Martinová", "Mašková", "Melicharová", "Minaříková", "Mrázová", "Navrátilová", "Němcová", "Němečková", 
                    "Nosková", "Nováčková", "Nováková", "Pavelková", "Pechová", "Pešková", "Peterková", "Petříková", 
                    "Poláčková", "Přibylová", "Procházková", "Prokešová", "Prokopová", "Řeháková", "Řezníčková", "Říhová", 
                    "Růžičková", "Šebestová", "Sedláčková", "Sedláková", "Ševčíková", "Šimonová", "Skálová", "Sklenářová", 
                    "Škodová", "Sládková", "Slámová", "Slavíková", "Slezáková", "Smejkalová", "Smetanová", "Šmídová", 
                    "Sobotková", "Soukupová", "Šrámková", "Stehlíková", "Štěpánková", "Štěpánová", "Straková", "Strnadová", 
                    "Stýskalová", "Suchánková", "Šulcová", "Svobodová", "Sýkorová", "Tomková", "Trávníčková", "Tučková", 
                    "Uherková", "Uhlířová", "Urbánková", "Vacková", "Václavíková", "Vaníčková", "Vaňková", "Vašíčková", 
                    "Vašková", "Večeřová", "Vítková", "Vítová", "Vlachová", "Vlasáková", "Vodičková", "Zapletalová", 
                    "Zatloukalová", "Žižková"
                ]
            }
        }
    },
    "sk": {
        "country": "Slovenská Republika",
        "nationality": "Slovak",
        "skin_color_probability": {
            "white" : 5,
            "black" : 1,
            "middle_east" : 1,
            "asian" : 3
        },
        "names": {
            "male": {
                "first": [
                    "Adam", "Aleš", "Alexander", "Alojz", "Andrej", "Augustín", "Aurel", "Bartolomej", "Benjamín", "Blažej", 
                    "Bohumír", "Bohuslav", "Branislav", "Bronislav", "Ctirad", "Cyril", "Dalibor", "Daniel", "Dávid", "Denis", 
                    "Dionýz", "Dominik", "Drahoslav", "Dušan", "Eduard", "Eugen", "Filip", "Gabriel", "Gregor", "Henrich", 
                    "Imrich", "Ivan", "Jakub", "Ján", "Jaroslav", "Jonáš", "Jozef", "Július", "Juraj", "Kamil", "Karol", 
                    "Kazimír", "Koloman", "Kornel", "Ladislav", "Ľubomír", "Ľuboš", "Lukáš", "Marcel", "Marek", "Marián", 
                    "Martin", "Matej", "Matúš", "Maximilián", "Metod", "Michal", "Mikuláš", "Milan", "Miloš", "Miloslav", 
                    "Oliver", "Ondrej", "Patrik", "Pavol", "Peter", "Radovan", "René", "Richard", "Robert", "Roman", 
                    "Silvester", "Šimon", "Slavomír", "Stanislav", "Štefan", "Tadeáš", "Teodor", "Tibor", "Timotej", 
                    "Tomáš", "Václav", "Valentín", "Viktor", "Viliam", "Vincent", "Vít", "Vladimír", "Vojtech", "Vratislav", 
                    "Zdenko", "Zdeno", "Žigmund"
                ],
                "last": [
                    "Bača", "Baník", "Bartoš", "Biely", "Biskup", "Bosko", "Chren", "Chrobák", "Cibuľka", "Čiernik", 
                    "Čierny", "Čížik", "Čuda", "Dobrovodský", "Doležal", "Dolina", "Havel", "Hodža", "Holič", "Holub", 
                    "Hornický", "Horník", "Jahoda", "Jankovič", "Jeleň", "Kľúčiar", "Kočiš", "Kocúr", "Kollár", "Komár", 
                    "Koreň", "Kostra", "Kováč", "Kráľ", "Kríž", "Kuchár", "Láska", "Maliar", "Malina", "Malý", "Mäsiar", 
                    "Mečiar", "Medveď", "Medvedík", "Mlynár", "Mokrý", "Mráz", "Nedved", "Novák", "Otčenáš", "Pekár", 
                    "Pokorný", "Rybár", "Široký", "Skalický", "Sklenár", "Slaný", "Slavik", "Smutný", "Šťastný", "Strnád", 
                    "Suchý", "Surový", "Tesár", "Tesarik", "Tichý", "Zima"
                ]
            },
            "female": {
                "first": [
                    "Adriana", "Albína", "Alena", "Alexandra", "Alica", "Alžbeta", "Amália", "Anastázia", "Andrea", 
                    "Anna", "Antónia", "Barbora", "Blanka", "Božena", "Branislava", "Bronislava", "Cecília", "Dagmar", 
                    "Danica", "Daniela", "Darina", "Denisa", "Dominika", "Dorota", "Dušana", "Edita", "Ema", "Ester", 
                    "Eva", "Gertrúda", "Hana", "Hedviga", "Ivana", "Ivanka", "Iveta", "Jana", "Jarmila", "Jaroslava", 
                    "Jolana", "Jozefína", "Judita", "Júlia", "Justína", "Kamila", "Katarína", "Kristína", "Ladislava", 
                    "Lenka", "Linda", "Ľubica", "Ľubomíra", "Lucia", "Lýdia", "Margita", "Mária", "Mariana", "Marika", 
                    "Marta", "Martina", "Melánia", "Michaela", "Miroslava", "Monika", "Natália", "Nela", "Nikola", 
                    "Nina", "Oľga", "Olívia", "Paulína", "Petra", "Petronela", "Renáta", "Romana", "Sára", "Silvia", 
                    "Simona", "Sofia", "Soňa", "Stanislava", "Štefánia", "Svetlana", "Tamara", "Valentína", "Valéria", 
                    "Vanda", "Vanesa", "Viktória", "Vilma", "Vladimíra", "Zita", "Zlatica", "Žofia", "Zora", "Zuzana", 
                    "Zuzka"
                ],
                "last": [
                    "Bartková", "Bellová", "Blahová", "Botošová", "Bottová", "Bratislavská", "Chlebovcová", "Chlebovská", 
                    "Čierna", "Čiliaková", "Čudová", "Eštoková", "Grgasová", "Hodosyová", "Hodžová", "Hrljacová", 
                    "Jánošíková", "Jilemnická", "Jilemničková", "Kaliská", "Kočišová", "Koleničková", "Kollárová", 
                    "Kostrová", "Kováčová", "Kráľová", "Lukáčová", "Mišurová", "Novomedská", "Novomeská", "Ondrejová", 
                    "Országhová", "Paučulová", "Petrová", "Pivovarčová", "Pleštinská", "Prešovská", "Rázusová", "Repková", 
                    "Rybárová", "Šafáriková", "Smreková", "Tesárová", "Turošíkova", "Urbanová", "Vajanská", "Vojtechová", 
                    "Vysoká", "Zahorecová", "Záhorecová"
                ]
            }
        }
    },
    "ind": {
        "country": "Republic of India",
        "nationality": "Indian",
        "skin_color_probability": {
            "white" : 1,
            "black" : 6,
            "middle_east" : 2,
            "asian" : 2
        },
        "names": {
            "male": {
                "first": [
                    "Aakash", "Abhi", "Abhinav", "Acarya", "Aditya", "Ajatasatru", "Aman", "Amar", "Amish", "Amitabh", 
                    "Amitodana", "Amrit", "Anguri", "Anuraag", "Arjuna", "Aryabhata", "Aryabhatta", "Asha", "Ashtavakra", 
                    "Ashutosh", "Ayaan", "Ayush", "Baibhav", "Bana", "Bhima", "Bhrigu", "Chakravarti", "Chand", "Chanda", 
                    "Chandra", "Chandrama", "Chatur", "Chhotu", "Chunder", "Cyavana", "Daas", "Daksh", "Dasra", "Daya", 
                    "Dayananda", "Dhani", "Dheeraj", "Dhirtarashtra", "Dhule", "Din", "Dyal", "Gagan", "Ganesh", "Gopal", 
                    "Govind", "Gunadhya", "Hala", "Har", "Harsh", "Hira", "Ishwar", "Jagadis", "Jaswant", "Jawahar", 
                    "Jayadeva", "Jeet", "Jhanda", "Jwala", "Kahoda", "Kapila", "Karam", "Katyayana", "Keshav", "Krishan", 
                    "Krishna", "Kusika", "Lakshmana", "Madhava", "Madhavacharta", "Maha", "Mahadaji", "Manas", "Megaduta", 
                    "Megh", "Mohun", "Nakshatra", "Nakula", "Narayana", "Nasatya", "Navin", "Navneet", "Om", "Patanjali", 
                    "Peeyush", "Prakash", "Pranav", "Prashant", "Prem", "Raghu", "Ragunath", "Rahul", "Ramaeshwara", 
                    "Ranjan", "Ranjit", "Ravi", "Rhitanshu", "Roodra", "Santosh", "Savyaschin", "Shackcham", 
                    "Shankaracharya", "Sharad", "Sooraj", "Srijan", "Sumit", "Sunder", "Varuni", "Venkata", "Vikas", 
                    "Vineet", "Vinod", "Vishnu", "Viswamitra", "Viswarupa", "Vrikodara", "Waazir", "Yad", "Yogarasa"
                ],
                "last": [
                    "Adhya", "Adwani", "Ahuja", "Ajagavakar", "Anagal", "Ashtekar", "Ashtikar", "Ayyangar", "Ayyar", 
                    "Bagchi", "Bajpai", "Bajpeyi", "Bakshi", "Banahatti", "Bandyopadhyay", "Barigai", "Barvadekar", 
                    "Bhardvaj", "Bhatavadekar", "Bhatta", "Bhavalakar", "Bhave", "Chadda", "Chakarvarti", "Chaudhari", 
                    "Chetti", "Chipalunakar", "Chitanis", "Chopade", "Dalavi", "Dattachaudhuri", "Dayal", "Devadhikar", 
                    "Devdhar", "Dhavale", "Dhebar", "Dheer", "Divakar", "Divekar", "Dongerkerry", "Dvivedi", "Ganapuli", 
                    "Gandhi", "Gazdar", "Gharapure", "Ghoshal", "Gulati", "Gupta", "Gurnani", "Haldar", "Haradas", 
                    "Harish", "Havaldar", "Hegadi", "Heravdakar", "Jadhav", "Jagatap", "Jayavant", "Kamal", "Kanungo", 
                    "Kapadia", "Kapil", "Karamchand", "Lata", "Limbu", "Mahanta", "Malhotra", "Mallaya", "Mandalik", 
                    "Marwah", "Mehrotra", "Mirchandani", "Misra", "Mukhtar", "Munshi", "Muzumdar", "Naidu", "Nambisan", 
                    "Nambiyar", "Nancy", "Nandi", "Navathe", "Nayar", "Nijasure", "Ojha", "Padhi", "Pande", "Pandya", 
                    "Panja", "Parachure", "Parekh", "Parikh", "Patel", "Patil", "Patvardhan", "Pavagi", "Phadanis", 
                    "Phadatare", "Poddar", "Raj", "Rajavade", "Ranganekary", "Roychaudhuri", "Sabanis", "Sardar", 
                    "Sarkar", "Satavelekar", "Seth", "Shevade", "Shrivastava", "Singh", "Sinha", "Srivastav", 
                    "Talavalakar", "Tamhanakar", "Thakore", "Tipanis", "Upadhyay", "Upalekar", "Upasani", "Vad", 
                    "Vadekar", "Vaknis", "Viswan", "Vyas"
                ]
            },
            "female": {
                "first": [
                    "Aahana", "Aaina", "Aaliya", "Aasmi", "Aishwarya", "Akshara", "Amandara", "Ambika", "Ananya", "Anu", 
                    "Anushree", "Archita", "Arpita", "Arya", "Ashia", "Bhadrakali", "Bhageerathi", "Bhairavi", "Bumati", 
                    "Chambeli", "Chamunda", "Chandi", "Cheeno", "Chhaya", "Chhotimai", "Damayanti", "Draupati", "Durga", 
                    "Durgautti", "Gauri", "Indira", "Indu", "Jindan", "Jyoti", "Kalpana", "Kalyani", "Kamala", "Kannagi", 
                    "Kanti", "Kanwal", "Karuna", "Kasturbai", "Kavuri", "Komal", "Krishna", "Krishnaa", "Kumari", "Kunti", 
                    "Kusum", "Lakshmi", "Lasya", "Lavanya", "Leela", "Madri", "Mahi", "Mamta", "Manjistha", "Maya", 
                    "Mina", "Minakshi", "Minu", "Muskaanb", "Nagini", "Neha", "Nehal", "Nupur", "Nutan", "Padmini", 
                    "Palak", "Paraminta", "Pari", "Parvati", "Phoolan", "Praanvi", "Priya", "Priyanshi", "Radha", 
                    "Raktavati", "Rati", "Rekha", "Ruhi", "Rushpa", "Saanvi", "Salani", "Samarj", "Sanskriti", "Sarama", 
                    "Sarasvati", "Sarojini", "Saryu", "Saurandhri", "Sena", "Shakti", "Shakuntala", "Shanti", "Shitala", 
                    "Shreya", "Shristi", "Shruti", "Sita", "Snigdha", "Sonamoni", "Sukanya", "Sumati", "Surya", "Tarabai", 
                    "Tivra", "Uma", "Urvasi", "Vaidehi", "Vayu", "Vijaya", "Zohana"
                ],
                "last": [
                    "Acharekar", "Achaval", "Ashtekar", "Ashtikar", "Badakar", "Bagchi", "Bajpai", "Bajpeyi", "Bakshi", 
                    "Banahatti", "Bandyopadhyay", "Bhagat", "Bhatavadekar", "Bhate", "Bhatta", "Bhattacharya", "Bhavalakar", 
                    "Chadda", "Chakarvarti", "Chaudhari", "Choraghad", "Dalavi", "Dattachaudhuri", "Devarukhkar", "Devdhar", 
                    "Dhebar", "Dheer", "Divakar", "Divekar", "Dongerkerry", "Dvivedi", "Ganapuli", "Gazdar", "Gharapure", 
                    "Goyal", "Gupta", "Gurnani", "Haldar", "Haradas", "Hegadi", "Heravdakar", "Holkar", "Jagatap", "Jayavant", 
                    "Joshi", "Kamath", "Kanungo", "Kapadia", "Kapil", "Kapudia", "Karamchand", "Kashyap", "Kayal", "Khamavant", 
                    "Kumar", "Lata", "Limbu", "Mahalanabis", "Mahanta", "Malhotra", "Mallaya", "Malviya", "Mandalik", "Marwah", 
                    "Mayadev", "Mehrotra", "Misra", "Mudaliyar", "Mukhtar", "Munshi", "Munshif", "Muzumdar", "Naidu", "Nambiyar", 
                    "Navathe", "Nijasure", "Ojha", "Padagavakar", "Padhya", "Panda", "Pande", "Pandey", "Pandya", "Panikkar", 
                    "Panja", "Parachure", "Parekh", "Parikh", "Patel", "Patil", "Patvardhan", "Phadanis", "Phadatare", "Prabhu", 
                    "Punja", "Raj", "Rajavade", "Randhawa", "Roychaudhuri", "Sanyal", "Sardar", "Satavelekar", "Seth", "Shevade", 
                    "Shree", "Shrivastav", "Sirasikar", "Talavalakar", "Tavade", "Thacker", "Thakore", "Thakur", "Tipanis", 
                    "Upalekar", "Upandhye", "Upasani", "Vad", "Vadekar", "Vaikar", "Viswan"
                ]
            }
        }
    },
    "pl": {
        "country": "Rzeczpospolita Polska",
        "nationality": "Polish",
        "skin_color_probability": {
            "white" : 5,
            "black" : 1,
            "middle_east" : 1,
            "asian" : 3
        },
        "names": {
            "male": {
                "first": [
                    "Adam", "Albert", "Albin", "Aleks", "Aleksander", "Aleksy", "Alfons", "Ambroży", "Anatol", "Anton",
                    "Arkadiusz", "Arnold", "Artur", "August", "Bartłomiej", "Bazyli", "Benedykt", "Bernard", "Błażej",
                    "Bogdan", "Bogumił", "Bogumir", "Bogusław", "Bolesław", "Bonifacy", "Bronisław", "Brunon", "Celestyn",
                    "Cezary", "Cyprian", "Damian", "Dariusz", "Dawid", "Denis", "Dominik", "Edmund", "Emil", "Ernest",
                    "Eryk", "Fabian", "Felicjan", "Feliks", "Filip", "Fryderyk", "Gerwazy", "Gościsław", "Grodzisław",
                    "Grzegorz", "Herbert", "Hilary", "Horacy", "Hubert", "Ignacy", "Igor", "Ireneusz", "Iwan", "Izydor",
                    "Jacek", "Jan", "Jarosław", "Jerzy", "Józef", "Julian", "Juliusz", "Kacper", "Kajetan", "Kamil",
                    "Karol", "Klemens", "Kornel", "Korneliusz", "Krzysztof", "Ksawery", "Kuba", "Leonard", "Leopold",
                    "Lew", "Lubomił", "Lubomir", "Lucjan", "Ludomił", "Ludwik", "Maciej", "Maksymilian", "Marcel",
                    "Marian", "Mariusz", "Mateusz", "Metody", "Mikołaj", "Mirosław", "Narcyz", "Norbert", "Oktawiusz",
                    "Olgierd", "Oskar", "Pankracy", "Patryk", "Polikarp", "Przemek", "Przemysław", "Robert", "Roch",
                    "Sebastian", "Szczepan", "Szymon", "Teodor", "Tobiasz", "Tymon", "Tytus", "Wacław", "Walenty",
                    "Walerian", "Wiesław", "Wiktor", "Wilhelm", "Wincenty", "Witold", "Władysław", "Włodzisław",
                    "Wojsław", "Zbigniew", "Zenobiusz", "Zenon", "Zygfryd", "Zygmunt"
                ],
                "last": [
                    "Adamczak", "Antczak", "Bachar", "Bakalar", "Banasiak", "Banaszyński", "Barylski", "Berk", "Bernacki",
                    "Bieńkowski", "Bilik", "Bilski", "Błaszkiewicz", "Bobowski", "Boczek", "Bogdan", "Bolek", "Bonczek",
                    "Boros", "Borowiak", "Borowski", "Brodnicki", "Brodzka", "Bronowski", "Brzyski", "Buczyński", "Budzik",
                    "Burek", "Burzyński", "Byk", "Cholewiński", "Chomicki", "Cich", "Cichoń", "Cisek", "Ciszek", "Cybulski",
                    "Cywiński", "Czekaj", "Danowski", "Doktor", "Drozd", "Dula", "Dusza", "Duszyński", "Figura", "Filipski",
                    "Gabris", "Gaida", "Gąsiorowski", "Gazda", "Gierek", "Golik", "Golonka", "Gołuń", "Górak", "Gostomski",
                    "Gradowski", "Grega", "Groch", "Grodzki", "Grygiel", "Gucwa", "Hebda", "Holda", "Jagła", "Jagodziński",
                    "Jandura", "Janko", "Janusz", "Józefowicz", "Kaczor", "Kamieński", "Kapuściński", "Karban", "Kijek",
                    "Klebba", "Kociński", "Kolba", "Kondrat", "Konkol", "Kopański", "Korecki", "Kornacki", "Kosowski",
                    "Kostka", "Kotarski", "Kownacki", "Koza", "Kozera", "Kozik", "Kramarz", "Krupiński", "Krusiński",
                    "Krzemien", "Krzeszewski", "Kubiś", "Kulesza", "Kurtyka", "Kuźniar", "Kwiecień", "Łabuś", "Łazowski",
                    "Legerski", "Leżoń", "Libera", "Lipiński", "Łojek", "Ludwin", "Maciej", "Malewski", "Małkowski",
                    "Marcinkiewicz", "Marek", "Matelski", "Mazurkiewicz", "Mika", "Miłek", "Milko", "Molek", "Motycki",
                    "Mroczka", "Myszkowski", "Nadolny", "Napieralski", "Nędza", "Niedbalski", "Niezgoda", "Nowik", "Okoń",
                    "Orlikowski", "Pac", "Paciorek", "Pakulski", "Pałys", "Pianka", "Piątkowski", "Pieróg", "Pietraś",
                    "Połczyński", "Półtorak", "Pozorski", "Prusak", "Pruszkowski", "Puch", "Rekowski", "Rozum", "Rusiecki",
                    "Ruszkowski", "Rzepka", "Samborski", "Sarna", "Sas", "Sawka", "Sierakowski", "Skalski", "Skoczylas",
                    "Ślimak", "Słoma", "Sobuś", "Sokolik", "Solarz", "Sołtysiak", "Stasiak", "Strzyżewski", "Stuczyński",
                    "Supiński", "Supko", "Sypek", "Szarek", "Szuba", "Szumski", "Szweda", "Tarnowski", "Terlecki", "Toczek",
                    "Tomasik", "Urbanek", "Urbaniak", "Walkowicz", "Wargin", "Wiater", "Wiciński", "Wodziński", "Wolanin",
                    "Wolanowski", "Wolek", "Worzałła", "Zabawa", "Zarzycki", "Żbikowski", "Zgoda", "Żmuda", "Zubał", "Żyłka"
                ]
            },
            "female": {
                "first": [
                    "Adelajda", "Agnieszka", "Aleksandra", "Amanda", "Aneta", "Angelika", "Aniela", "Anita", "Anna", 
                    "Antonina", "Arleta", "Aurelia", "Barbara", "Blanka", "Bogna", "Bogumiła", "Bożena", "Celina", 
                    "Danuta", "Daria", "Dominika", "Dorota", "Eleonora", "Elwira", "Eugenia", "Ewa", "Ewelina", 
                    "Faustyna", "Franciszka", "Gabriela", "Genowefa", "Grażyna", "Halina", "Hanna", "Helena", 
                    "Henryka", "Honorata", "Iga", "Ilona", "Iwona", "Izabela", "Jadwiga", "Jagoda", "Joanna", 
                    "Józefa", "Józefina", "Julia", "Julita", "Justyna", "Kalina", "Kamila", "Karolina", "Kasandra", 
                    "Katarzyna", "Klara", "Klaudia", "Kornelia", "Krystyna", "Kunegunda", "Lidia", "Lilia", "Liliana", 
                    "Linda", "Ludmiła", "Ludwika", "Magdalena", "Malina", "Malwina", "Maria", "Marianna", "Marlena", 
                    "Marta", "Maryla", "Maryna", "Melania", "Michalina", "Milena", "Mirosława", "Monika", "Nadia", 
                    "Nadzieja", "Natasza", "Nikola", "Nina", "Olga", "Oliwia", "Otylia", "Pamela", "Patrycja", "Paula", 
                    "Paulina", "Pelagia", "Pola", "Ramona", "Regina", "Renata", "Roksana", "Ruta", "Sabina", "Sandra", 
                    "Sara", "Stanisława", "Stefania", "Tamara", "Tatiana", "Teodora", "Teresa", "Walentyna", "Weronika", 
                    "Wiara", "Wiesława", "Wiktoria", "Wioleta", "Wisława", "Żaneta", "Zdzisława", "Zofia"
                ],
                "last": [
                    "Anczok", "Antczak", "Antek", "Asnyk", "Baba", "Babin", "Babula", "Bachar", "Bakula", "Bal", 
                    "Balicka", "Bartek", "Bartosz", "Bazar", "Bednorz", "Bereza", "Biskup", "Bogdańska", "Broda", 
                    "Bugaj", "Buras", "Buza", "Cackowska", "Chomicka", "Cichocka", "Cieśla", "Cuda", "Czyż", 
                    "Danowska", "Drzymała", "Działo", "Dzikowska", "Fabin", "Foltyn", "Furman", "Gałkowska", 
                    "Gibas", "Glińska", "Głowińska", "Gogol", "Gogola", "Gola", "Golba", "Golubska", "Gościńska", 
                    "Grzywa", "Grzywacz", "Gubała", "Jagłowska", "Jakubowska", "Janiak", "Janik", "Janko", "Jordan", 
                    "Kamrowska", "Kaniecka", "Kasprzyk", "Kawa", "Kisielewska", "Kita", "Kloc", "Koltun", "Komar", 
                    "Kopeć", "Koprowska", "Korczyńska", "Kossak", "Kostrzewska", "Kotłowska", "Kotowicz", "Kotowska", 
                    "Kotulin", "Kowalczyk", "Kowalik", "Kozera", "Kuczmarska", "Kula", "Kułakowska", "Kurszewska", 
                    "Lachowska", "Lepkowska", "Lewkowicz", "Liśko", "Łojko", "Luby", "Maćkowiak", "Maczuga", 
                    "Manikowska", "Marciniszyn", "Marcinkowska", "Marcinowska", "Marecka", "Matulewicz", "Mendyk", 
                    "Micek", "Milanowska", "Misiaszek", "Mizak", "Mleczko", "Moder", "Moszkowska", "Myszkowska", 
                    "Niec", "Niemiec", "Nykiel", "Ogórek", "Okonek", "Ołdakowska", "Olender", "Orkan", "Orzeł", 
                    "Osentoska", "Ossowska", "Pachucka", "Paryś", "Pasek", "Patyk", "Pawłowicz", "Peplińska", 
                    "Perzan", "Pięta", "Polek", "Popko", "Potocka", "Pouch", "Pozorska", "Prusak", "Przybylińska", 
                    "Ptaszyńska", "Pytlik", "Rapacz", "Ratajczak", "Rawska", "Ringwelska", "Robak", "Romanowicz", 
                    "Rosół", "Roszak", "Rożak", "Rudas", "Rusak", "Rzepecka", "Sabała", "Sadłowska", "Sasala", 
                    "Sienkiewicz", "Sikorska", "Simińska", "Skiba", "Skokan", "Skorupska", "Smolińska", "Sobek", 
                    "Sobiech", "Sobocińska", "Sobolewicz", "Sokal", "Sołtysiak", "Stankiewicz", "Stankowska", 
                    "Stankus", "Stec", "Stokłosa", "Strzelecka", "Świderska", "Świech", "Swoboda", "Sysło", 
                    "Szpilman", "Szwarcman", "Tadych", "Tokarz", "Tom", "Tomala", "Tomczak", "Tomczyk", "Ulatowska", 
                    "Ulma", "Walega", "Wiech", "Wierzbińska", "Wilińska", "Wójcik", "Wojcińska", "Wolanin", 
                    "Wolińska", "Woźny", "Żaczek", "Żak", "Żakowska", "Zięba", "Ziobro", "Żółtowska"
                ]
            }
        }
    },
    "ge": {
        "country": "Bundesrepublik Deutschland",
        "nationality": "German",
        "skin_color_probability": {
            "white" : 2,
            "black" : 1,
            "middle_east" : 1,
            "asian" : 1
        },
        "names": {
            "male": {
                "first": [
                    "Aayden", "Abraham", "Achim", "Adam", "Adrian", "Alex", "Alfred", "Alois", "Andre", "Andreas", 
                    "Angelo", "Anton", "Armin", "Arno", "Arnold", "Arthur", "Augustin", "Bastian", "Benedict", 
                    "Benedikt", "Benjamin", "Björn", "Bruno", "Caesar", "Carl", "Caspar", "Casper", "Chris", 
                    "Christian", "Claus", "Clemens", "Daniel", "David", "Dominik", "Elmar", "Elmo", "Emanuel", 
                    "Eric", "Erik", "Falco", "Falko", "Felix", "Ferdinand", "Flo", "Florentin", "Flori", "Franz", 
                    "Fritz", "Gregor", "Gunnar", "Hans", "Harald", "Harri", "Hermann", "Hugo", "Isaak", "Jacob", 
                    "Joachim", "Jochen", "Johan", "Johann", "Jonas", "Jonathan", "Jörn", "Josua", "Julian", "Julius", 
                    "Karl", "Kaspar", "Kasper", "Kevin", "Kilian", "Klaus", "Klemens", "Konstantin", "Kuno", "Lasse", 
                    "Leo", "Leon", "Leopold", "Lorenz", "Louis", "Ludwig", "Luis", "Manuel", "Marcel", "Marian", 
                    "Mario", "Marius", "Mathias", "Matteo", "Max", "Maximilian", "Milo", "Moritz", "Nick", "Nicola", 
                    "Niels", "Norbert", "Ole", "Oli", "Oliver", "Otto", "Pascal", "Paskal", "Patrik", "Paul", "Paulus", 
                    "Peter", "Philipp", "Piet", "Ralf", "Rayko", "Robby", "Robert", "Robin", "Rolf", "Roman", "Sam", 
                    "Silvio", "Sören", "Steffen", "Stephen", "Swen", "Theo", "Theodor", "Thomas", "Tillmann", "Tim", 
                    "Tobi", "Tom", "Tommy", "Torsten", "Tristan", "Ulrich", "Valle", "Vincent", "Wilhelm", "Yannick"
                ],
                "last": [
                    "Abt", "Aichele", "Albrecht", "Arendt", "Bach", "Bain", "Basinger", "Baumann", "Bessemer", "Blanke",
                    "Blatt", "Blum", "Blumentritt", "Boden", "Bönsch", "Börner", "Brahm", "Brahms", "Brandt", "Brecher",
                    "Breuer", "Bruhns", "Buchholz", "Carstens", "Clasen", "Cossmann", "Dassler", "Denker", "Detmold",
                    "Diemer", "Drescher", "Dünhaupt", "Ehman", "Eich", "Eichhorn", "Eisen", "Engelberg", "Fähnrich",
                    "Faulhaber", "Feininger", "Fiedler", "Fischer", "Fittkau", "Freisler", "Freudenstein", "Gebhardt",
                    "Gessler", "Glasser", "Gottschalk", "Grassl", "Grebel", "Grünspan", "Gustloff", "Habicht", "Hackenholt",
                    "Häring", "Hartknoch", "Haselrieder", "Hasenclever", "Hauffe", "Hauschka", "Hausmann", "Hautzig",
                    "Hecher", "Hegeler", "Heilmann", "Heim", "Heitz", "Hellmann", "Helmke", "Hengstler", "Heydrich",
                    "Hillebrand", "Hirtreiter", "Hoelscher", "Hoenigsberg", "Honigberg", "Hönigmann", "Honigsman", "Johner",
                    "Kahler", "Kassebaum", "Käutner", "Kautz", "Kestenbaum", "Keyserling", "Kielholz", "Kiesling",
                    "Kirchweger", "Klopp", "Kogler", "Köler", "Kornberg", "Kott", "Krakouer", "Kreutzwald", "Krist",
                    "Kroeger", "Kroll", "Kronenberg", "Kühne", "Kummer", "Lafrenz", "Landau", "Lechner", "Lettmann",
                    "Lichter", "Lieblein", "Lobe", "Loos", "Mannheim", "Mencken", "Neuheuser", "Noske", "Osterhaus",
                    "Pfeffer", "Pilc", "Preissner", "Quaschny", "Rabe", "Raupach", "Reder", "Riedel", "Riemenschneider",
                    "Rinder", "Rodenberg", "Rorer", "Rosenstock", "Rothberg", "Röthke", "Rottmann", "Salzer", "Schichau",
                    "Schilling", "Schirmer", "Schlick", "Schmidt", "Schnell", "Schnorr", "Schöner", "Schreiber", "Schröpfer",
                    "Schulz", "Schütz", "Schweiger", "Schwerin", "Schwerner", "Seidl", "Söllner", "Sommerfeld", "Spitzer",
                    "Stäbler", "Stahl", "Stein", "Steinbauer", "Steinberger", "Steinitz", "Sternhell", "Stockert",
                    "Strassmann", "Straube", "Strub", "Suckow", "Tanneberger", "Taube", "Theil", "Tisch", "Uebelhoer",
                    "Unterberger", "Veiel", "Wach", "Wagenseil", "Wahle", "Weinreich", "Weishaupt", "Weitzmann", "Weller",
                    "Wendlinger", "Wentz", "Wernz", "Widmann", "Wildner", "Wilhelm", "Winkelhock", "Wirth"
                ]
            },
            "female": {
                "first": [
                    "Alicia", "Alma", "Amanda", "Amelie", "Angela", "Anja", "Annalena", "Anneli", "Annelie", "Annemarie",
                    "Anni", "Annika", "Annina", "Ann-Katrin", "Anny", "Barbara", "Bianka", "Cäcilia", "Cäcilie", "Carmen",
                    "Catarina", "Catharina", "Cecilia", "Celina", "Celine", "Christina", "Christine", "Claudi", "Claudia",
                    "Daniela", "Daria", "Denise", "Doris", "Dorothe", "Eileen", "Eleonore", "Elin", "Elisa", "Elise",
                    "Ella", "Ellen", "Emilia", "Erica", "Erika", "Esther", "Eve", "Evelyn", "Felia", "Felice", "Fiona",
                    "Franzi", "Franziska", "Freya", "Gabi", "Gerda", "Gina", "Gloria", "Gwen", "Hannah", "Hanne",
                    "Hannelore", "Helena", "Hella", "Helmina", "Helmine", "Hermina", "Hermine", "Ina", "Isabell", "Isabella",
                    "Iva", "Jennifer", "Jil", "Jill", "Johanna", "Josi", "Juliana", "Jutta", "Karin", "Karolin", "Karolina",
                    "Kathrin", "Katja", "Katrin", "Kerstin", "Klara", "Kristin", "Lara", "Larissa", "Lea", "Lena", "Leo",
                    "Lia", "Lore", "Louisa", "Louise", "Lucie", "Luise", "Luka", "Lulu", "Lydia", "Lynn", "Madleen",
                    "Magdalena", "Mandy", "Mareike", "Margaretha", "Marlene", "Melanie", "Melissa", "Merle", "Michaela",
                    "Mira", "Mirjam", "Mona", "Narzissa", "Natascha", "Neele", "Nele", "Nicola", "Nike", "Noemi", "Oda",
                    "Penelope", "Rebeca", "Rebecca", "Rebekka", "Rena", "Renate", "Ricarda", "Rosa", "Rosalia", "Sabine",
                    "Samira", "Sandra", "Saskia", "Seraphina", "Silke", "Sissi", "Sofie", "Sophie", "Stella", "Susanna",
                    "Svea", "Svenja", "Tatjana", "Teresa", "Theresa", "Ulrike", "Vanessa", "Verena", "Victoria", "Viola",
                    "Vivianne", "Wiebke", "Yosefin", "Yosefine", "Zora"
                ],
                "last": [
                    "Achleitner", "Albiker", "Arendt", "Aumeier", "Auspitz", "Austerlitz", "Bergen", "Bergler", "Bischof", 
                    "Blanke", "Blaustein", "Blecher", "Blumenthal", "Bodenschatz", "Brandis", "Breytenbach", "Büchner", 
                    "Bussler", "Clasen", "Curschmann", "Deichgräber", "Drachmann", "Drescher", "Drexler", "Duden", 
                    "Eichenberg", "Eisenstadt", "Ettlinger", "Faas", "Fähnrich", "Feinberg", "Felgenhauer", "Fincke", 
                    "Finke", "Fischbein", "Fitkau", "Fleischman", "Florstedt", "Frenz", "Frenzel", "Freudenberger", 
                    "Fürstenberg", "Geiger", "Gerstaecker", "Geschwind", "Gilger", "Goethe", "Goldblatt", "Gramlich", 
                    "Grosskopf", "Grossman", "Haberkorn", "Hagel", "Hämmerli", "Hänel", "Hannig", "Hardt", "Hartjenstein", 
                    "Hattenberger", "Hautzig", "Hechler", "Hecht", "Heerwagen", "Hegeler", "Heidemann", "Hengsbach", 
                    "Henzler", "Herberger", "Hess", "Heuser", "Hillebrand", "Hilscher", "Hirschl", "Hoenigberg", "Janke", 
                    "Kachel", "Kadelburg", "Kahn", "Kalkbrenner", "Kant", "Katzen", "Käutner", "Kehlmann", "Keppler", 
                    "Klinghoffer", "Koeppen", "Kohl", "Kohlberg", "Krakouer", "Kranefuss", "Krantz", "Kratochwil", "Krier", 
                    "Kupferblum", "Landsteiner", "Lasker", "Lehman", "Lehr", "Lerner", "Leupold", "Lips", "Löffler", 
                    "Lohmüller", "Loos", "Lustenberger", "Lutz", "Maibaum", "Maisel", "Mandelbaum", "Mann", "Masing", 
                    "Meckler", "Meidner", "Mengele", "Mensing", "Metzinger", "Müntefering", "Neuhäuser", "Nottebohm", 
                    "Oberlander", "Oppolzer", "Pabst", "Peucker", "Pfeiffer", "Pfister", "Pilzer", "Pohl", "Quaschny", 
                    "Rahmer", "Raupach", "Reger", "Reich", "Reitz", "Riedel", "Rieger", "Rimensberger", "Rinder", 
                    "Romberg", "Rorer", "Rosenberger", "Sauerbeck", "Schedl", "Scheibel", "Scheiner", "Scherrer", 
                    "Schichau", "Schickedanz", "Schiffer", "Schimscheiner", "Schleibaum", "Schlessinger", "Schlim", 
                    "Schmadel", "Schmerling", "Schnell", "Scholl", "Schön", "Schor", "Schreiner", "Schubert", "Schuttler", 
                    "Schwertner", "Semmler", "Sendler", "Seydel", "Spanner", "Specht", "Speckmann", "Spielberg", "Spörl", 
                    "Stenzel", "Stieler", "Stockert", "Storl", "Strauch", "Strauss", "Strub", "Stüber", "Sundermann", 
                    "Surmann", "Tangemann", "Tarr", "Theiner", "Thomalla", "Ueberroth", "Van", "Visscher", "Von", 
                    "Wagenknecht", "Wegener", "Weizmann", "Windisch", "Witting"
                ]
            }
        }
    },
    "tr": {
        "country": "Republic of Türkiye",
        "nationality": "Turkish",
        "skin_color_probability": {
            "white" : 3,
            "black" : 1,
            "middle_east" : 5,
            "asian" : 1
        },
        "names": {
            "male": {
                "first": [
                    "Acabay", "Acabey", "Adas", "Aker", "Akinci", "Akintan", "Akkas", "Akkurt", "Aksogut", "Aksungur",
                    "Alisan", "Alkis", "Alpar", "Alpayer", "Alpbilge", "Alpertunga", "Alpyurek", "Altin", "Amac", "Ari",
                    "Arkadas", "Armagan", "Arpag", "Arsal", "Arslan", "Arslaner", "Ataergin", "Atli", "Avci", "Aydin",
                    "Aydinc", "Aydintan", "Aydogdu", "Aykut", "Aytolun", "Aytop", "Ayyildiz", "Balbay", "Baskurt", "Batihan",
                    "Batuhan", "Bayar", "Bayhan", "Birol", "Bugra", "Bulent", "Burak", "Cagri", "Canan", "Canol", "Cem",
                    "Cemal", "Damar", "Deniz", "Dilmac", "Diri", "Emir", "Energin", "Er", "Erdem", "Erdin", "Erdinc",
                    "Ergenekon", "Ergor", "Erhun", "Ersoz", "Ersu", "Ertac", "Ertas", "Ertekin", "Eryaman", "Ese", "Evren",
                    "Eylul", "Ezel", "Fikri", "Gediz", "Gencer", "Goksel", "Goktug", "Guc", "Gulhan", "Gunduzhan", "Guner",
                    "Gurhan", "Halil", "Haluk", "Hamdi", "Hizir", "Icten", "Ihsan", "Ildes", "Ilginc", "Ilim", "Ilkay",
                    "Ilteris", "Imren", "Inal", "Kai", "Kam", "Kaner", "Kara", "Kaya", "Kayin", "Kazak", "Kilic", "Kizil",
                    "Kubilay", "Kudret", "Kutay", "Kuzey", "Mahir", "Mehmet", "Menderes", "Mertkan", "Nazik", "Necmi",
                    "Nejat", "Oguzhan", "Oray", "Oren", "Osman", "Ozakar", "Ozel", "Ozer", "Ozgu", "Ozil", "Ozker", "Remzi",
                    "Ridvan", "Sabri", "Saglam", "Sair", "Sakin", "Sariaslan", "Saru", "Say", "Sefa", "Semih", "Sercan",
                    "Serkan", "Sumer", "Tan", "Tanalp", "Tanju", "Taskin", "Tayfur", "Terim", "Tokalp", "Tolay", "Torumtay",
                    "Tosunbey", "Toycan", "Tumkor", "Tuna", "Tur", "Turk", "Turkdogdu", "Turker", "Turkoglu", "Tutku", "Ucok",
                    "Ugurlu", "Ulas", "Ulker", "Umut", "Unay", "Unlu", "Unluol", "Velit", "Vural", "Yaban", "Yagizboga",
                    "Yamac", "Yavuzsoy", "Yenerol", "Yengi", "Yeter", "Yildir", "Yolal", "Yoma", "Yuksel", "Yurttas", "Zeynel",
                    "Ziya", "Zoral", "Zorlu"
                ],
                "last": [
                    "Aga", "Agca", "Ak", "Akar", "Akarsu", "Akbulut", "Akcam", "Akcatepe", "Akdari", "Akgun", 
                    "Akkilic", "Akkoyun", "Akpinar", "Aktug", "Akyuz", "Aldemir", "Alkan", "Altun", "Arica", 
                    "Armagan", "Arman", "Asani", "Atan", "Ataseven", "Aydemir", "Aydinlar", "Aydogan", "Aygun", 
                    "Aykut", "Balci", "Bardakci", "Baybasin", "Baydar", "Baykal", "Behcet", "Bilgi", "Bilgili", 
                    "Bilgin", "Binay", "Birkan", "Boz", "Boztepe", "Bulut", "Burcak", "Cagri", "Catli", "Cavus", 
                    "Ceylan", "Cicek", "Ciftci", "Ciller", "Coban", "Coskun", "Dagdelen", "Dalman", "Dede", 
                    "Demir", "Demirel", "Demirtas", "Dervis", "Dursun", "Efendi", "Ekici", "Ekren", "Emin", 
                    "Enver", "Erbil", "Erdal", "Erdem", "Eren", "Erentoz", "Erim", "Ermis", "Erol", "Farhi", 
                    "Gokay", "Gokce", "Gonul", "Gucer", "Gulden", "Gunaydin", "Gundogdu", "Gunduz", "Gunes", 
                    "Halman", "Hamzaoglu", "Hanim", "Heper", "Hikmet", "Ilgaz", "Ilkin", "Inal", "Inonu", "Ipekci", 
                    "Kahveci", "Karadeniz", "Karadere", "Karaman", "Karatas", "Karatay", "Kashani", "Kavur", 
                    "Kaya", "Kaymak", "Kimyacioglu", "Kinali", "Kirac", "Kiraz", "Kucuk", "Kurt", "Kut", "Kutay", 
                    "Kutlu", "Levni", "Memis", "Mujde", "Murat", "Nadir", "Nalband", "Nazli", "Niazi", "Ocak", 
                    "Ocal", "Olmez", "Onal", "Onaral", "Onarici", "Ozal", "Ozcan", "Ozcelik", "Ozel", "Ozer", 
                    "Ozil", "Ozmert", "Ozsoy", "Öztürk", "Peker", "Pocan", "Safak", "Saltik", "Samet", "Sancak", 
                    "Sancar", "Sanli", "Sezgin", "Sokmen", "Sumer", "Tanyu", "Taskiran", "Terzioglu", "Togay", 
                    "Toner", "Topal", "Toraman", "Tuncel", "Turan", "Turkoglu", "Tuzun", "Usak", "Usta", "Uygun", 
                    "Uysal", "Uzan", "Uzun", "Veli", "Vural", "Yanki", "Yasar", "Yavas", "Yavuz", "Yazar", 
                    "Yigit", "Zarakolu", "Zorlu"
                ]
            },
            "female": {
                "first": [
                    "Ahu", "Akarsu", "Akses", "Alageyik", "Alev", "Alim", "Altin", "Altinay", "Altinnur", "Arman",
                    "Arsal", "Askin", "Asli", "Asya", "Ay", "Aybike", "Ayda", "Aydolun", "Aygun", "Aykut", "Ayla", 
                    "Aylin", "Ayse", "Aysun", "Aytop", "Baci", "Bahar", "Banu", "Basak", "Bati", "Begum", "Benay",
                    "Beren", "Bilgehan", "Bircan", "Biricik", "Birsen", "Buke", "Burcak", "Buse", "Busra", "Cagla",
                    "Cakir", "Damla", "Deger", "Derin", "Devlet", "Dicle", "Dilara", "Dilmen", "Dincay", "Dogu", "Ece",
                    "Eda", "Elcin", "Elik", "Emek", "Emel", "Erbil", "Erdi", "Erel", "Ergun", "Erim", "Eris", "Ese", "Esen",
                    "Evren", "Evrim", "Eylul", "Fatma", "Fatmagul", "Fikir", "Gediz", "Gizem", "Gok", "Gokce", "Goksun", "Gul",
                    "Gulcan", "Gulen", "Gullu", "Gulsu", "Gunaydin", "Guncicek", "Gunhan", "Guray", "Hadiye", "Hande", "Hayat",
                    "Hidayet", "Idil", "Ildeniz", "Ildes", "Ilgi", "Isenbike", "Isik", "Isit", "Ismet", "Izel", "Kadin", "Kamer",
                    "Karagoz", "Kardelen", "Karya", "Kivanc", "Konca", "Kugu", "Kutay", "Lale", "Meltem", "Naz", "Nazenin", "Nazik",
                    "Nazli", "Nese", "Nesrin", "Nevin", "Nilay", "Nilufer", "Nimet", "Nisan", "Nur", "Oren", "Ovunc", "Ozak", "Ozcan",
                    "Ozdes", "Ozge", "Ozgu", "Ozler", "Sabiha", "San", "Sansal", "Saziye", "Selin", "Semiha", "Seran", "Sertac", "Servet",
                    "Sevgili", "Sevilay", "Sevin", "Seyma", "Sezgin", "Sirin", "Sohret", "Sonbahar", "Su", "Sukran", "Sumer", "Tamay", "Tanju",
                    "Tankut", "Tansu", "Tuna", "Turkan", "Turker", "Turkmen", "Ulke", "Ulker", "Umit", "Umut", "Unay", "Uzay", "Yahsi", "Yasemin",
                    "Yeter", "Yonal", "Yosun", "Yurt", "Zeyno"
                ],
                "last": [
                    "Abdil", "Acar", "Adivar", "Aga", "Ahmad", "Akdari", "Akkaya", "Akkoyun", "Aksoy", "Aktas", 
                    "Akyildiz", "Akyol", "Ali", "Altin", "Altintop", "Apak", "Aras", "Aydinlar", "Baba", "Bal", 
                    "Bayar", "Bayrak", "Bayraktar", "Bayramoglu", "Bereket", "Berker", "Bilgin", "Birol", "Bozkurt", 
                    "Bucak", "Budak", "Bugra", "Buker", "Bulut", "Caglar", "Cakir", "Calis", "Can", "Celal", "Celebi", 
                    "Ceren", "Cimen", "Colak", "Cubukcu", "Dal", "Dalkilic", "Deliktas", "Demirkan", "Denktas", 
                    "Dikmen", "Dilaver", "Dinc", "Dogan", "Dogancay", "Doruk", "Durmaz", "Dursun", "Efendi", "Ekren", 
                    "Engin", "Ercan", "Erdal", "Erdinc", "Ergen", "Ergun", "Eris", "Erol", "Ertunc", "Farhi", "Firat", 
                    "Giray", "Gokcen", "Gokmen", "Gollu", "Gozubuyuk", "Gucer", "Gul", "Gulpinar", "Gundogdu", 
                    "Gungor", "Gurses", "Halefoglu", "Hamdi", "Hamzaoglu", "Hasim", "Heper", "Inan", "Inonu", 
                    "Ipekci", "Kahraman", "Kaptan", "Karaca", "Karadeniz", "Karakas", "Karakaya", "Karakoc", 
                    "Karaman", "Kavur", "Kilic", "Kilicli", "Kimyacioglu", "Kirdar", "Kizil", "Kizilirmak", "Kobal", 
                    "Kocer", "Koray", "Kubilay", "Kucuk", "Kunt", "Kurtoglu", "Kutlu", "Mehmet", "Memis", "Mencik", 
                    "Mumcu", "Nabi", "Nalci", "Namik", "Nas", "Ocak", "Ocal", "Okay", "Okur", "Onan", "Onder", 
                    "Onut", "Osman", "Ozden", "Ozhan", "Ozker", "Ozkok", "Ozmen", "Öztürk", "Parlak", "Peker", 
                    "Polat", "Renda", "Reza", "Sabanci", "Sabri", "Saglik", "Sakir", "Saltik", "Sancak", "Saylan", 
                    "Sensoy", "Sevgi", "Seyfi", "Simsek", "Taner", "Tasci", "Taylan", "Tekin", "Topuz", "Toraman", 
                    "Torun", "Tosun", "Tufekci", "Tuna", "Turgut", "Turkan", "Turkoglu", "Turkyilmaz", "Tuzun", 
                    "Ucar", "Ulas", "Unal", "Usak", "Uygun", "Yagci", "Yagmur", "Yasar", "Yavas", "Yavuz", "Yazar", 
                    "Yesilnil", "Yildiz", "Yilmaz"
                ]
            }
        }
    },
    "ru": {
        "country": "Russian Federation",
        "nationality": "Russian",
        "skin_color_probability": {
            "white" : 5,
            "black" : 1,
            "middle_east" : 3,
            "asian" : 3
        },
        "names": {
            "male": {
                "first": [
                    "Abram Vsevolodovich", "Adam Dmitrievich", "Afanasiy Igorevich", "Aleksandr Alesnarovich",
                    "Aleksei Afanasievich", "Aleksei Nikitovich", "Aleksei Tikhonovich", "Anatoliy Savelievich",
                    "Anatoliy Sergeyevich", "Andrei Antonovich", "Andrei Leonidovich", "Androniki Filippovich",
                    "Arseniy Timurovich", "Artem Valentinovich", "Benedikt Artemovich", "Bogdan Savelievich",
                    "Bogdan Vladislavovich", "Boleslaw Maximovich", "Boris Vladimirovich", "Boris Yevgenievich",
                    "Cheslav Dmitrievich", "Christov Timofeyevich", "Christov Vitalievich", "Damian Romanovich",
                    "Damir Yegorovich", "Danila Makarovich", "Danila Stanislavovich", "Danya Afanasievich",
                    "David Makarovich", "Demian Yemelyanovich", "Dimitri Stanislavovich", "Dmitriy Ilyich",
                    "Eduard Valentinovich", "Elie Grigorievich", "Erik Borisovich", "Erik Vladimirovich",
                    "Eugeni Borisovich", "Faddei Vsevolodovich", "Foma Larionovich", "Gavril Mikhailovich",
                    "Gavril Svyatoslavovich", "Gennadiy Gennadiyevich", "Gennadiy Yanovich", "Georgiy Timofeyevich",
                    "Gerasim Valentinovich", "German Svyatoslavovich", "Grigoriy Anatolievich", "Grigoriy Innokentievich",
                    "Grigoriy Makarovich", "Grigoriy Rostislavovich", "Ignatiy Larionovich", "Igor Olegovich",
                    "Ikovle Vladimirovich", "Ilarion Yakovich", "Ilya Afanasievich", "Innokentiy Vladislavovich",
                    "Iosif Artemovich", "Iosif Denisovich", "Iosif Mikhailovich", "Ippolit Antonovich",
                    "Ippolit Larionovich", "Ippolit Victorovich", "Isaak Artemovich", "Isaak Vsevolodovich",
                    "Isaak Yemelyanovich", "Ivan Valerianovich", "Karl Germanovich", "Karl Stepanovich",
                    "Karl Valerianovich", "Kazimir Leonidovich", "Klavdiy Nikitovich", "Kliment Yaroslavovich",
                    "Kliment Yemelyanovich", "Kliment Yevgenievich", "Kliment Zakharovich", "Kondrati Germanovich",
                    "Kondrati Vadimovich", "Konstantin Yegorovich", "Korney Mikhailovich", "Korney Vyacheslavovich",
                    "Krasimir Artemovich", "Kusma Igorevich", "Larion Tikhonovich", "Lavrenti Vladimirovich",
                    "Lavrentiy Igorevich", "Lavrenti Zakharovich", "Lavr Grigorievich", "Leonid Konstantinovich",
                    "Leonid Timurovich", "Luchok Borisovich", "Luchok Filippovich", "Luchok Yemelyanovich",
                    "Ludomir Innokentievich", "Ludomir Leonidovich", "Luka Yermolayevich", "Lukyan Borisovich",
                    "Lukyan Svyatoslavovich", "Makar Denisovich", "Maksim Yegorovich", "Marka Konstantinovich",
                    "Marka Nikitovich", "Matvei Tarasovich", "Matvei Tikhonovich", "Mikhail Dmitrievich",
                    "Mikhail Svyatoslavovich", "Milorad Anatolievich", "Milorad Vadimovich", "Milorad Yegorovich",
                    "Mitrofan Romanovich", "Oleg Rodionovich", "Oleg Ruslanovich", "Osip Larionovich",
                    "Osip Vadimovich", "Panteley Kirillovich", "Panteley Sergeyevich", "Polikarp Danilovich",
                    "Potap Pavlovich", "Potap Yemelyanovich", "Pyotr Svyatoslavovich", "Radoslav Maximovich",
                    "Radoslav Semyonovich", "Rasim Konstantinovich", "Rasim Maximovich", "Robert Sergeyevich",
                    "Rodion Anatolievich", "Rodion Rodionovich", "Rodion Svyatoslavovich", "Ruslan Mikhailovich",
                    "Ruslan Valeryevich", "Rustem Danilovich", "Saveliy Petrovich", "Saveliy Yaroslavovich",
                    "Sergei Stanislavovich", "Sergey Makarovich", "Sergey Nikolayevich", "Stanislav Ivanovich",
                    "Stepan Vadimovich", "Svyatoslav Konstantinovich", "Svyatoslav Romanovich", "Svyatoslav Sergeyevich",
                    "Svyatoslav Tarasovich", "Tanas Georgiyevich", "Timofei Rodionovich", "Timofey Fyodorovich",
                    "Timofey Leonidovich", "Timofey Vitalievich", "Timofey Yurievich", "Urvan Yemelyanovich",
                    "Ustin Nikolayevich", "Vadim Artemovich", "Vadim Igorevich", "Vadim Vyacheslavovich",
                    "Valentin Dmitrievich", "Valentin Innokentievich", "Valentin Vyacheslavovich", "Valeriy Yemelyanovich",
                    "Vaniamin Yemelyanovich", "Vasiliy Innokentievich", "Vasiliy Timofeyevich", "Vasiliy Yemelyanovich",
                    "Vassili Olegovich", "Victor Anatolievich", "Victor Valerianovich", "Victor Vasilievich",
                    "Vikentiy Romanovich", "Vikentiy Stepanovich", "Vikentiy Tarasovich", "Vikentiy Tikhonovich",
                    "Viktor Yemelyanovich", "Vitaliy Danilovich", "Vitaliy Valeryevich", "Vitaliy Yegorovich",
                    "Vladimir Larionovich", "Vladimir Timofeyevich", "Vladimir Vasilievich", "Vladislav Igorevich",
                    "Vladislav Tikhonovich", "Vladislav Vitalievich", "Yaroslav Innokentievich", "Yegor Nikolayevich",
                    "Yegor Yaroslavovich", "Yelisey Innokentievich", "Yelisey Yaroslavovich", "Yelisey Yurievich",
                    "Yeremey Denisovich", "Yevdokim Sergeyevich", "Yevgeniy Denisovich", "Yevgeniy Romanovich",
                    "Yevgeniy Tikhonovich", "Yevgeniy Vasilievich", "Yulian Kirillovich", "Yulian Yegorovich",
                    "Yuriy Maximovich", "Yuriy Valentinovich", "Zakhar Vladimirovich", "Zhenka Stanislavovich",
                    "Zhenka Stepanovich", "Zigfrids Vasilievich", "Zinoviy Igorevich"
                ],
                "last": [
                    "Ageykin", "Aksenchuk", "Aleyev", "Alistratov", "Anishin", "Anokhin", "Antonov", "Arefyev", "Artyomov", "Asmik", 
                    "Avdeyev", "Averyanov", "Avilov", "Babikov", "Balabanov", "Barinov", "Batishchev", "Bazhanov", "Belomestnov", 
                    "Bokaryov", "Boldyrev", "Brantov", "Bugakov", "Bukavitsky", "Bukov", "Burtsov", "Buryakov", "Chazov", 
                    "Chebotaryov", "Chepurin", "Chernomyrdin", "Chesnokov", "Chmykhov", "Chuprakov", "Delov", "Dementyev", 
                    "Dragunov", "Dryomov", "Dyogtin", "Dyomin", "Elefterov", "Emsky", "Fedchenkov", "Firsov", "Galygin", 
                    "Gavrilenkov", "Glagolev", "Glazkov", "Golodyayev", "Golov", "Golovanov", "Golubev", "Goraya", "Gorokhin", 
                    "Gunin", "Ignatyev", "Igoshin", "Isayev", "Ivkin", "Kachusov", "Kalagin", "Kapralov", "Kapriyanov", "Kapustin", 
                    "Kapustov", "Kashkanov", "Khalturin", "Kharzin", "Khaslik", "Khlebov", "Khokhlachev", "Kirsanov", "Kiryanov", 
                    "Klimushin", "Kochenkov", "Kocheryozhkin", "Kolomnikov", "Komarov", "Kosaryov", "Kosorukov", "Kozlovsky", 
                    "Krasotkin", "Krupin", "Kublanov", "Kudrin", "Kuklev", "Kurakin", "Kurdin", "Kutuzov", "Kuvayev", "Lapin", 
                    "Lavrentyev", "Ledovskoy", "Legkodimov", "Listunov", "Losev", "Luzhkov", "Lyutov", "Manin", "Marinin", 
                    "Marinov", "Maslak", "Mesyats", "Mikheyev", "Minkovski", "Mukhov", "Myaukin", "Nasonov", "Nechayev", 
                    "Nemtsov", "Novikov", "Oborin", "Oshurkov", "Osminin", "Pakhomov", "Panarin", "Pashkov", "Pereverzev", 
                    "Permyakov", "Pestov", "Pivovarov", "Ponchikov", "Post", "Privalov", "Protasov", "Puzakov", "Pyatosin", 
                    "Rodin", "Rudin", "Rumyantsev", "Runov", "Ryabov", "Saitov", "Saltanov", "Samarin", "Sapalyov", "Senkin", 
                    "Seryogin", "Shapovalov", "Sharapov", "Sidorov", "Sigayev", "Silin", "Silvestrov", "Siyangulov", "Siyanin", 
                    "Smotrov", "Sobolevsky", "Stepanov", "Sukin", "Suslyakov", "Tatarintsev", "Tikhvinsky", "Timoshenko", 
                    "Tokarev", "Tolbanov", "Tolkachyov", "Toropov", "Travnikov", "Tsiolkovsky", "Tsyganov", "Tsyzyrev", "Ulitsky", 
                    "Urakov", "Ushakov", "Vakhrov", "Valevach", "Vavilov", "Vorobyov", "Yablokov", "Yablonev", "Yakovlev", 
                    "Yaroslavsky", "Yartsin", "Yedemsky", "Yeleshev", "Yemelyanov", "Yenin", "Yenotin", "Yerkulayev", "Yermilov", 
                    "Yermushin", "Yesaulov", "Yevseyev", "Yubkin", "Yudachyov", "Yunge", "Yunkin", "Zefirov", "Zorin"
                ]
            },
            "female": {
                "first": [
                    "Agafia Afanasievna", "Agafia Yurievna", "Agafya Svyatoslavovna", "Agasha Yegorovna", 
                    "Agnessa Rodionovna", "Agrafena Danilovna", "Agrafena Svyatoslavovna", "Aksinya Rodionovna", 
                    "Albina Fyodorovna", "Albina Timofeyevna", "Aleksandra Ruslanovna", "Alena Leonidovna", 
                    "Alina Anatolievna", "Alina Stepanovna", "Alina Valerianovna", "Alyona Vitalievna", 
                    "Amaliya Innokentievna", "Amaliya Zakharovna", "Anastasia Sergeyevna", "Anastasiya Vitalievna", 
                    "Anfisa Vladimirovna", "Anninka Makarovna", "Anninka Yegorovna", "Antonina Vsevolodovna", 
                    "Arina Innokentievna", "Beatriks Sergeyevna", "Danulka Nikitovna", "Danulka Olegovna", 
                    "Danulka Yevgenievna", "Daria Valentinovna", "Edita Larionovna", "Ekaterina Rodionovna", 
                    "Elena Kirillovna", "Eleonora Romanovna", "Elisaveta Stanislavovna", "Elvira Savelievna", 
                    "Emma Aleksandrovna", "Emma Yemelyanovna", "Eudokia Innokentievna", "Eudoxia Yurievna", 
                    "Evdokiya Yermolayevna", "Evgenia Sergeyevna", "Evgenia Yakovna", "Fenya Vladislavovna", 
                    "Feodora Leonidovna", "Feodora Vitalievna", "Frosya Germanovna", "Fyodora Nikolayevna", 
                    "Galina Fyodorovna", "Galina Igorievna", "Galya Borisovna", "Grusha Stanislavovna", 
                    "Ida Petrovna", "Inessa Anatolievna", "Inessa Yemelyanovna", "Inga Georgievna", 
                    "Inna Valentinovna", "Irina Pavlovna", "Irina Sergeyevna", "Ivanna Pavlovna", 
                    "Janna Nikitovna", "Janna Petrovna", "Jelena Petrovna", "Jelena Yurievna", 
                    "Johana Fyodorovna", "Karina Georgievna", "Karolina Yemelyanovna", "Katenka Anatolievna", 
                    "Katerina Dmitrievna", "Katusha Grigorievna", "Katusha Makarovna", "Khristina Fyodorovna", 
                    "Kira Nikolayevna", "Klara Dmitrievna", "Kostyusha Valentinovna", "Kostyusha Zakharovna", 
                    "Kotinka Gennadievna", "Kotinka Ruslanovna", "Kristina Anatolievna", "Kristina Olegovna", 
                    "Kristina Valerievna", "Kristina Yegorovna", "Kseniya Valerianovna", "Lada Ruslanovna", 
                    "Lara Artemievna", "Lena Valerievna", "Lenka Gennadievna", "Lenora Valerianovna", 
                    "Lida Zakharovna", "Lilia Stepanovna", "Lisenka Ivanovna", "Ludmila Pavlovna", 
                    "Lydia Grigorievna", "Lydia Olegovna", "Lyubov Ilyinishna", "Lyubov Olegovna", 
                    "Lyubov Yaroslavovna", "Manka Pavlovna", "Manya Maximovna", "Mara Borisovna", 
                    "Marfa Nikitovna", "Margarita Sergeyevna", "Maria Grigorievna", "Marianna Andreevna", 
                    "Marianna Filippovna", "Maria Vladislavovna", "Maruska Semyonovna", "Marya Innokentievna", 
                    "Marya Timurovna", "Masha Nikitovna", "Matryona Yevgenievna", "Maya Valerianovna", 
                    "Melashka Grigorievna", "Melashka Yaroslavovna", "Milda Artemievna", "Miloslava Dmitrievna", 
                    "Miloslava Stepanovna", "Milyena Yaroslavovna", "Mira Afanasievna", "Nadia Rodionovna", 
                    "Nadka Rodionovna", "Nashka Vsevolodovna", "Nastasya Tikhonovna", "Nastasya Valerievna", 
                    "Natasha Sergeyevna", "Nelya Yurievna", "Nessia Olegovna", "Nymphadora Romanovna", 
                    "Nyura Yermolayevna", "Olga Larionovna", "Olyusha Yaroslavovna", "Pavlina Aleksandrovna", 
                    "Praskovya Alekseevna", "Raina Victorovna", "Raisa Aleksandrovna", "Raisa Makarovna", 
                    "Raisa Yegorovna", "Rakhil Innokentievna", "Rakhil Stepanovna", "Rakhil Valerianovna", 
                    "Raya Vitalievna", "Rosina Maximovna", "Roza Semyonovna", "Ruzha Tikhonovna", 
                    "Ruzha Valentinovna", "Selena Valerievna", "Selinka Georgievna", "Senta Kirillovna", 
                    "Sofya Andreevna", "Stesha Ilyinishna", "Stesha Ruslanovna", "Svetla Fyodorovna", 
                    "Svetla Maximovna", "Svetlana Fyodorovna", "Svetlana Victorovna", "Svetlana Vitalievna", 
                    "Svetla Nikolayevna", "Tamara Timofeyevna", "Tanka Kirillovna", "Tanka Vitalievna", 
                    "Tanya Ruslanovna", "Tasha Svyatoslavovna", "Tasha Yanovna", "Tatiana Innokentievna", 
                    "Tereza Savelievna", "Tereza Vasilievna", "Valentina Stepanovna", "Valeriya Alekseevna", 
                    "Valeriya Yanovna", "Valeriya Yegorovna", "Valka Timurovna", "Varvara Rostislavovna", 
                    "Varvara Vladimirovna", "Vasilisa Yevgenievna", "Vera Semyonovna", "Verinka Anatolievna", 
                    "Veronika Filippovna", "Verusya Antonovna", "Verusya Maximovna", "Verusya Valentinovna", 
                    "Viktoria Aleksandrovna", "Viktoria Yanovna", "Viktoria Yaroslavovna", "Viola Maximovna", 
                    "Viola Vladislavovna", "Violetta Zakharovna", "Vlada Rostislavovna", "Vladislava Germanovna", 
                    "Vladislava Zakharovna", "Yeva Nikitovna", "Yevdokiya Ruslanovna", "Yuliana Nikitovna", 
                    "Yulinka Stepanovna", "Yuliya Germanovna", "Yuliya Yanovna", "Zenaide Anatolievna", 
                    "Zenaide Romanovna", "Zinaida Yanovna", "Zoya Vsevolodovna"
                ],
                "last": [
                    "Agapova", "Akulova", "Alenina", "Alexeyeva", "Alliluyeva", "Andropova", "Anikanova", "Antonova", 
                    "Arsenyeva", "Assonova", "Averina", "Azhishchenkova", "Barsukova", "Beloglazova", "Belorusova", 
                    "Berezina", "Bogolepova", "Bogolyubova", "Bokaryova", "Bukina", "Charkova", "Chekmaryova", 
                    "Chendeva", "Chernobrovina", "Chumakova", "Chuprina", "Dezhnyova", "Dobrolyubova", "Dorofeyeva", 
                    "Dorokhina", "Drugova", "Emina", "Entina", "Entskaya", "Fedotova", "Galiaskarova", "Golovina", 
                    "Golubova", "Golubtsova", "Grankina", "Ilkuna", "Ilyushina", "Ivashova", "Ivkina", "Kabinova", 
                    "Kalashnik", "Kalganova", "Kalugina", "Kapralova", "Kapustina", "Karaulina", "Kartashyova", 
                    "Kashkanova", "Kashuba", "Khodyayeva", "Khudovekova", "Kirilishena", "Klimtsova", "Kollerova", 
                    "Kopsova", "Korovina", "Koskova", "Kotova", "Kozyreva", "Kruglikova", "Kublanova", "Kubyshkina", 
                    "Kudashova", "Kuklova", "Kuptsova", "Kurbatova", "Kuzkina", "Kuzubova", "Lachkova", "Lagoshina", 
                    "Ledovskaya", "Legkodimova", "Leonova", "Listratova", "Loskutnikova", "Lvova", "Lyasina", 
                    "Lyutova", "Mashir", "Meledina", "Melikova", "Melnikova", "Migunova", "Minkina", "Mitina", 
                    "Mokhova", "Mozhayeva", "Mukhina", "Mukhomorova", "Mukhortova", "Nazarova", "Nesterova", 
                    "Novokshonova", "Nuriyeva", "Obraztsova", "Onipchenko", "Osintseva", "Ostrovskaya", "Pechkina", 
                    "Perezhogina", "Pervak", "Polovtseva", "Poltanova", "Portnova", "Preobrazhenskaya", "Pronicheva", 
                    "Pshenichnikova", "Putinova", "Raspopova", "Razuvayeva", "Roshchina", "Rusakova", "Ryabtseva", 
                    "Rychenkova", "Ryurikova", "Safiyulina", "Safronova", "Sedova", "Semichayevskaya", "Seryogina", 
                    "Shabalina", "Shakmakova", "Shaposhnikova", "Shastina", "Shchavelskaya", "Shchedrina", 
                    "Shchekochikhina", "Shcherbatykh", "Shchukina", "Shelagina", "Shibalova", "Shirinova", 
                    "Shirmanova", "Shubkina", "Shuldeshova", "Sigalova", "Silivanova", "Siyanchuk", "Sizy", 
                    "Skvortsova", "Slepynina", "Smagina", "Smolina", "Sokolova", "Soldatova", "Sonina", 
                    "Starodubtseva", "Sukina", "Surnina", "Susoyeva", "Tabakova", "Tatarova", "Tetereva", 
                    "Tokmakova", "Toporova", "Trofimova", "Tsekhanovetskaya", "Tsulukidze", "Tyannikova", 
                    "Ulyashina", "Umanova", "Umskaya", "Untilova", "Usilova", "Usoyeva", "Ustyuzhanina", "Vazova", 
                    "Vedeneyeva", "Vikasheva", "Vitayeva", "VodovosB", "Volikova", "Vyalitsyna", "Yakubovich", 
                    "Yakusheva", "Yankovskaya", "Yanukovich", "Yazova", "Yemelina", "Yenotova", "Yershova", 
                    "Yeshevskaya", "Yevseyeva", "Zaytseva", "Zhdanova", "Zhestakova", "Zhidkova"
                ]
            }
        }
    },
    "ua": {
        "country": "Ukraine",
        "nationality": "Ukrainian",
        "skin_color_probability": {
            "white" : 5,
            "black" : 1,
            "middle_east" : 3,
            "asian" : 2
        },
        "names": {
            "male": {
                "first": [
                    "Adam Bronislavovych", "Adam Kazymyrovych", "Adam Yaroslavovych", "Afanasij Bohdanovych",
                    "Afanasij Josypovych", "Afanasij Petrovych", "Anatolij Anatolijovych", "Anatolij Mykytovych",
                    "Andrij Ihorovych", "Andrij Omelyanovych", "Andrij Stepanovych", "Anton Borysovych",
                    "Anton Ostapovych", "Arkadij Maksymovych", "Arkadij Panasovych", "Arkadij Vitalijovych",
                    "Artem Afanasijovych", "Artem Myroslavovych", "Artem Olehovych", "Artur Dmytrovych",
                    "Artur Illich", "Bohdan Tymofijovych", "Borys Danylovych", "Borys Kazymyrovych",
                    "Borys Myronovych", "Bronislav Lyubomyrovych", "Bronislav Yukhymovych", "Danylo Borysovych",
                    "Danylo Havrylovych", "Danylo Ivanovych", "Danylo Omelyanovych", "Danylo Tarasovych",
                    "Denys Antonovych", "Denys Fedirovych", "Denys Savych", "Denys Vladyslavovych",
                    "Fedir Antonovych", "Fedir Romanovych", "Fedir Semenovych", "Fedir Viktorovych",
                    "Feodosij Mykytovych", "Havrylo Eduardovych", "Havrylo Kazymyrovych", "Havrylo Savych",
                    "Havrylo Valerijovych", "Henadij Afanasijovych", "Henadij Ihorovych", "Henadij Kostyantynovych",
                    "Henadij Stanislavovych", "Heorhij Omelyanovych", "Ihor Bronislavovych", "Ihor Leontijovych",
                    "Ihor Valentynovych", "Illya Antonovych", "Illya Oleksandrovych", "Ivan Feodosijovych",
                    "Ivan Leontijovych", "Ivan Pavlovych", "Josyp Feodosijovych", "Josyp Vasylovych",
                    "Josyp Yehorovych", "Kazymyr Adamovych", "Kazymyr Henadijovych", "Kazymyr Heorhijovych",
                    "Kazymyr Kuzmych", "Kazymyr Maksymovych", "Kazymyr Volodymyrovych", "Kuzma Ostapovych",
                    "Leonid Hryhorijovych", "Leonid Ihorovych", "Leonid Lyubomyrovych", "Leonid Vadymovych",
                    "Lyubomyr Yurijovych", "Lyubomyr Zynovijovych", "Maksym Valentynovych", "Mykhajlo Bronislavovych",
                    "Mykhajlo Mykhajlovych", "Mykhajlo Nazarovych", "Mykhajlo Yurijovych", "Mykola Kyrylovych",
                    "Mykola Maksymovych", "Mykola Yevhenovych", "Mykyta Leonidovych", "Mykyta Ruslanovych",
                    "Myron Vasylovych", "Myron Viktorovych", "Myroslav Andrijovych", "Myroslav Nazarovych",
                    "Myroslav Orestovych", "Myroslav Rostyslavovych", "Myroslav Semenovych", "Oleh Panasovych",
                    "Oleh Yakovych", "Oleksandr Hryhorijovych", "Oleksandr Petrovych", "Oleksij Feodosijovych",
                    "Oleksij Omelyanovych", "Oleksij Panasovych", "Omelyan Bronislavovych", "Omelyan Ivanovych",
                    "Omelyan Tarasovych", "Orest Kyrylovych", "Orest Ostapovych", "Orest Panasovych",
                    "Orest Valentynovych", "Ostap Denysovych", "Ostap Heorhijovych", "Ostap Hryhorijovych",
                    "Panas Bohdanovych", "Panas Vyacheslavovych", "Panas Yurijovych", "Pavlo Bronislavovych",
                    "Pavlo Danylovych", "Pavlo Feodosijovych", "Pavlo Leonidovych", "Pavlo Svyatoslavovych",
                    "Petro Pavlovych", "Petro Romanovych", "Pylyp Afanasijovych", "Pylyp Dmytrovych",
                    "Pylyp Ihorovych", "Roman Romanovych", "Roman Valentynovych", "Rostyslav Denysovych",
                    "Rostyslav Ihorovych", "Rostyslav Serhijovych", "Ruslan Olehovych", "Ruslan Viktorovych",
                    "Sava Oleksandrovych", "Sava Orestovych", "Sava Vsevolodovych", "Semen Anatolijovych",
                    "Semen Ostapovych", "Serhij Havrylovych", "Stanislav Mykhajlovych", "Stefan Havrylovych",
                    "Stefan Vadymovych", "Stefan Yaroslavovych", "Stepan Arturovych", "Stepan Bohdanovych",
                    "Stepan Oleksijovych", "Stepan Savych", "Svyatoslav Afanasijovych", "Svyatoslav Antonovych",
                    "Svyatoslav Semenovych", "Taras Henadijovych", "Taras Tymofijovych", "Trokhym Borysovych",
                    "Trokhym Myroslavovych", "Tymofij Leonidovych", "Tymofij Mykhajlovych", "Vadym Leontijovych",
                    "Valentyn Mykolovych", "Valentyn Pylypovych", "Valentyn Stefanovych", "Valerij Fedirovych",
                    "Valerij Heorhijovych", "Vasyl Antonovych", "Vasyl Mykytovych", "Vasyl Savych",
                    "Vasyl Trokhymovych", "Vasyl Vadymovych", "Viktor Semenovych", "Vitalij Kuzmych",
                    "Vitalij Petrovych", "Vitalij Yurijovych", "Vladyslav Dmytrovych", "Vladyslav Pylypovych",
                    "Vladyslav Vadymovych", "Volodymyr Antonovych", "Volodymyr Arkadijovych", "Volodymyr Danylovych",
                    "Volodymyr Dmytrovych", "Vsevolod Savych", "Vsevolod Valerijovych", "Vsevolod Vasylovych",
                    "Vyacheslav Myroslavovych", "Vyacheslav Svyatoslavovych", "Yakiv Havrylovych",
                    "Yaroslav Tymofijovych", "Yaroslav Vsevolodovych", "Yaroslav Vyacheslavovych",
                    "Yehor Henadijovych", "Yehor Kazymyrovych", "Yehor Leonidovych", "Yevhen Henadijovych",
                    "Yevhen Valerijovych", "Yukhym Adamovych", "Yukhym Andrijovych", "Yukhym Arkadijovych",
                    "Yukhym Dmytrovych", "Yukhym Ostapovych", "Yukhym Savych", "Yurij Havrylovych",
                    "Yurij Ivanovych", "Yurij Omelyanovych", "Yurij Yevhenovych", "Zynovij Myroslavovych"
                ],
                "last": [
                    "Andrijchuk", "Andrushchenko", "Antonenko", "Antonyuk", "Avramenko", "Bilyj", "Bilyk", "Blyznyuk", 
                    "Bodnar", "Bojchuk", "Bondar", "Bondarchuk", "Borovyk", "Buhaj", "Buryak", "Butenko", "Chernenko", 
                    "Chernysh", "Chupryna", "Demchenko", "Demchuk", "Denysenko", "Denysyuk", "Didenko", "Dmytrenko", 
                    "Dobrovolskyj", "Dotsenko", "Dovhan", "Dudnyk", "Fedorov", "Fesenko", "Filonenko", "Havrylyuk", 
                    "Herasymenko", "Holovko", "Honchar", "Honcharenko", "Honcharuk", "Horban", "Horobets", "Hrebenyuk", 
                    "Hryhorenko", "Hryshko", "Hrytsaj", "Humenyuk", "Husak", "Ilchenko", "Ivanchenko", "Ivanyuk", 
                    "Ivashchenko", "Khomenko", "Kolesnyk", "Kolisnyk", "Kolomiyets", "Kondratenko", "Kondratyuk", 
                    "Kononenko", "Korol", "Korzh", "Kosenko", "Kostenko", "Kostyuk", "Kovalchuk", "Kovalenko", 
                    "Kovtun", "Kozachenko", "Kozlov", "Kravchenko", "Kravchuk", "Kravets", "Kryvenko", "Kucher", 
                    "Kulyk", "Kysil", "Lebid", "Levchuk", "Loboda", "Lysyuk", "Lytovchenko", "Lytvyn", "Lytvynenko", 
                    "Martynenko", "Melnychenko", "Melnyk", "Miroshnychenko", "Moskalenko", "Muzyka", "Mykhajlenko", 
                    "Mykhajlov", "Mykhajlyuk", "Mykytyuk", "Nikolenko", "Novak", "Novikov", "Okhrimenko", "Olijnyk", 
                    "Omelchuk", "Onyshchenko", "Ostapenko", "Osypenko", "Palij", "Panasenko", "Panasyuk", "Panchenko", 
                    "Petrenko", "Petrov", "Petruk", "Petryk", "Polishchuk", "Popovych", "Prokopenko", "Protsenko", 
                    "Pryjmak", "Pylypenko", "Ruban", "Rud", "Ruda", "Rusnak", "Sakhno", "Samojlenko", "Savchenko", 
                    "Savenko", "Semenenko", "Semenyuk", "Shapoval", "Shapovalov", "Shcherbak", "Shevchenko", "Shulha", 
                    "Shynkarenko", "Sirenko", "Solovej", "Solovjov", "Soroka", "Stelmakh", "Stepanov", "Stetsenko", 
                    "Stetsyuk", "Storozhuk", "Tarasenko", "Tarasyuk", "Tkachuk", "Tsurkan", "Tsymbal", "Tymoshenko", 
                    "Tytarenko", "Usenko", "Vakulenko", "Vasylyuk", "Velychko", "Vlasenko", "Voloshyn", "Volynets", 
                    "Yakymchuk", "Yakymenko", "Yaremchuk", "Yashchenko", "Yatsenko", "Yeremenko", "Zayets"
                ]
            },
            "female": {
                "first": [
                    "Alina Vitaliyivna", "Alla Afanasiyivna", "Alla Danylivna", "Alla Kyrylivna", "Alla Yehorivna",
                    "Alla Yuriyivna", "Anastasiya Andriyivna", "Anastasiya Leonidivna", "Anastasiya Ostapivna",
                    "Anastasiya Vyacheslavivna", "Antonina Adamivna", "Antonina Vadymivna", "Antonina Zynoviyivna",
                    "Anzhela Kyrylivna", "Anzhela Tymofiyivna", "Bronislava Kostyantynivna", "Bronislava Valentynivna",
                    "Halyna Dmytrivna", "Halyna Hryhorivna", "Inna Arturivna", "Inna Ihorivna", "Inna Semenivna",
                    "Iryna Henadiyivna", "Iryna Kuzmivna", "Iryna Omelyanivna", "Iryna Vyacheslavivna", "Ivanna Adamivna",
                    "Ivanna Andriyivna", "Ivanna Vitaliyivna", "Kateryna Andriyivna", "Kateryna Arkadiyivna",
                    "Kateryna Myronivna", "Kateryna Romanivna", "Kateryna Yukhymivna", "Khrystyna Adamivna",
                    "Kseniya Eduardivna", "Kseniya Tarasivna", "Larysa Fedirivna", "Lidiya Hryhorivna", "Lidiya Leonidivna",
                    "Lidiya Ostapivna", "Lidiya Viktorivna", "Lidiya Yukhymivna", "Liliya Bohdanivna", "Liliya Savivna",
                    "Lina Yukhymivna", "Lina Yuriyivna", "Lyubov Arturivna", "Lyubov Henadiyivna", "Lyubov Valeriyivna",
                    "Lyudmyla Valeriyivna", "Marharyta Ihorivna", "Marharyta Illivna", "Marharyta Olehivna",
                    "Marharyta Rostyslavivna", "Marharyta Semenivna", "Mariya Bohdanivna", "Mariya Ihorivna",
                    "Mariya Kostyantynivna", "Mariya Maksymivna", "Mariya Tymofiyivna", "Marta Nazarivna",
                    "Marta Ruslanivna", "Maryna Ostapivna", "Myroslava Arturivna", "Myroslava Kyrylivna",
                    "Myroslava Omelyanivna", "Nadiya Feodosiyivna", "Nadiya Havrylivna", "Nadiya Savivna",
                    "Nadiya Svyatoslavivna", "Natalya Adamivna", "Natalya Antonivna", "Natalya Lyubomyrivna",
                    "Natalya Nazarivna", "Natalya Vsevolodivna", "Natalya Yukhymivna", "Nelya Danylivna",
                    "Nelya Denysivna", "Nelya Heorhiyivna", "Nelya Leontiyivna", "Nina Bronislavivna", "Nina Henadiyivna",
                    "Oksana Mykhajlivna", "Oleksandra Kostyantynivna", "Oleksandra Petrivna", "Oleksandra Stanislavivna",
                    "Oleksandra Vasylivna", "Olena Ivanivna", "Olena Stanislavivna", "Olena Stefanivna",
                    "Olesya Afanasiyivna", "Olesya Antonivna", "Olesya Tymofiyivna", "Orysya Viktorivna",
                    "Polina Fedirivna", "Polina Havrylivna", "Polina Stepanivna", "Rayisa Pavlivna", "Rayisa Svyatoslavivna",
                    "Rayisa Yukhymivna", "Ruslana Afanasiyivna", "Ruslana Arturivna", "Ruslana Denysivna",
                    "Ruslana Fedirivna", "Ruslana Oleksandrivna", "Sofiya Afanasiyivna", "Sofiya Arkadiyivna",
                    "Sofiya Feodosiyivna", "Sofiya Heorhiyivna", "Sofiya Illivna", "Sofiya Semenivna", "Sofiya Valeriyivna",
                    "Stanislava Petrivna", "Stanislava Yuriyivna", "Stefaniya Borysivna", "Stefaniya Zynoviyivna",
                    "Svitlana Mykolayivna", "Svitlana Stefanivna", "Tamara Arkadiyivna", "Tamara Havrylivna",
                    "Tamara Maksymivna", "Tamara Stepanivna", "Tamara Vladyslavivna", "Tayisiya Kuzmivna",
                    "Tayisiya Tymofiyivna", "Tetyana Feodosiyivna", "Tetyana Illivna", "Tetyana Lyubomyrivna",
                    "Tetyana Vladyslavivna", "Tetyana Yukhymivna", "Ulyana Mykolayivna", "Valentyna Feodosiyivna",
                    "Valentyna Pylypivna", "Valentyna Romanivna", "Valentyna Stanislavivna", "Valentyna Yehorivna",
                    "Viktoriya Vyacheslavivna", "Vira Dmytrivna", "Vira Leonidivna", "Vira Oleksiyivna",
                    "Vira Svyatoslavivna", "Vira Vitaliyivna", "Vira Yukhymivna", "Vita Artemivna", "Vita Kazymyrivna",
                    "Vita Orestivna", "Vita Pavlivna", "Vita Serhiyivna", "Vita Tymofiyivna", "Vladyslava Adamivna",
                    "Vladyslava Arkadiyivna", "Vladyslava Leontiyivna", "Vladyslava Rostyslavivna", "Yana Dmytrivna",
                    "Yana Vadymivna", "Yaroslava Arturivna", "Yaroslava Myronivna", "Yaroslava Rostyslavivna",
                    "Yaroslava Valeriyivna", "Yelizaveta Arturivna", "Yelizaveta Savivna", "Yelizaveta Trokhymivna",
                    "Yeva Eduardivna", "Yeva Stepanivna", "Yeva Vasylivna", "Yevdokiya Arturivna", "Yevdokiya Stepanivna",
                    "Yevdokiya Vadymivna", "Yevdokiya Vladyslavivna", "Yevdokiya Yevhenivna", "Yevdokiya Yuriyivna",
                    "Yevheniya Adamivna", "Yevheniya Heorhiyivna", "Yevheniya Kyrylivna", "Yevheniya Leonidivna",
                    "Yevheniya Volodymyrivna", "Yuliya Artemivna", "Yuliya Mykhajlivna", "Yuliya Yaroslavivna",
                    "Yuliya Zynoviyivna", "Zhanna Antonivna", "Zhanna Bohdanivna", "Zhanna Lyubomyrivna",
                    "Zhanna Omelyanivna", "Zhanna Romanivna", "Zhanna Stanislavivna", "Zoya Ihorivna", "Zoya Pylypivna",
                    "Zynayida Ihorivna", "Zynayida Leonidivna", "Zynayida Svyatoslavivna"
                ],
                "last": [
                    "Andriyenko", "Antonenko", "Babij", "Baran", "Baranova", "Bilous", "Bojchuk", "Bondar", "Bondarchuk",
                    "Bondarenko", "Borovyk", "Bozhko", "Butenko", "Chaban", "Chajka", "Chumachenko", "Chupryna", "Danylyuk",
                    "Datsenko", "Demchenko", "Demchuk", "Denysenko", "Dmytrenko", "Dobrovolska", "Dorosh", "Dotsenko",
                    "Dudnyk", "Dyachuk", "Dzyuba", "Fedorenko", "Furman", "Hajduk", "Havrylenko", "Havrysh", "Hlushchenko",
                    "Holovko", "Honchar", "Honcharuk", "Horbenko", "Hrebenyuk", "Hryshchenko", "Hryshko", "Hrytsenko",
                    "Hrytsyuk", "Ihnatenko", "Ilchuk", "Kharchenko", "Kobzar", "Kohut", "Kolomiyets", "Kondratenko",
                    "Kononenko", "Kornijchuk", "Kosenko", "Kostyuchenko", "Kotenko", "Kovalenko", "Kovtun", "Kramarenko",
                    "Kravchenko", "Kravets", "Kushnir", "Kuzmenko", "Kyrychenko", "Kyrylyuk", "Lazarenko", "Lutsenko",
                    "Lyashenko", "Lytvynenko", "Maksymenko", "Marchuk", "Martynenko", "Matvijchuk", "Matviyenko", "Medvid",
                    "Melnychenko", "Moskalenko", "Mykhajlova", "Mykytyuk", "Myronenko", "Nahorna", "Naumenko", "Nesterenko",
                    "Nikolenko", "Okhrimenko", "Oleksiyenko", "Oleksyuk", "Omelchenko", "Omelchuk", "Onyshchenko", "Onyshchuk",
                    "Osadchuk", "Osadchyj", "Ostapchuk", "Osypenko", "Palij", "Panasyuk", "Panchenko", "Panchuk", "Pavlenko",
                    "Pavlova", "Pavlyuk", "Perepelytsya", "Petrenko", "Petrova", "Petryk", "Polyakova", "Ponomarenko",
                    "Potapenko", "Prokopenko", "Pryjmak", "Romanchuk", "Ruda", "Rudyk", "Rusnak", "Samojlenko", "Savchenko",
                    "Semenenko", "Semenova", "Semenyuk", "Serdyuk", "Sereda", "Shcherbyna", "Sheremet", "Shevchuk", "Shostak",
                    "Skrypnyk", "Slobodyanyuk", "Slyusar", "Soroka", "Stasyuk", "Stelmakh", "Sushko", "Sych", "Symonenko",
                    "Sytnyk", "Tarasenko", "Tkach", "Tkachuk", "Tokar", "Tsurkan", "Tsymbalyuk", "Vashchenko", "Vasylchenko",
                    "Vasylenko", "Vdovychenko", "Velychko", "Volkova", "Volynets", "Vorona", "Yakovenko", "Yakymchuk",
                    "Yaroshenko", "Yashchuk", "Yatsenko", "Zakharchenko", "Zaporozhets", "Zayets", "Zozulya"
                ]
            }
        }
    },
    "jp": {
        "country": "Japan",
        "nationality": "Japanese",
        "skin_color_probability": {
            "white" : 1,
            "black" : 1,
            "middle_east" : 1,
            "asian" : 5
        },
        "names": {
            "male": {
                "first": [
                    "Akihito", "Akinori", "Akira", "Atshushi", "Atsumichi", "Bakin", "Botan", "Buncho", "Bunrakuken", 
                    "Chikafusa", "Daisetsu", "Danno", "Eien", "Eikichi", "Eishi", "Eizan", "Fujimaro", "Fumihiro", 
                    "Gihei", "Gonshiro", "Haranobu", "Hidetsugu", "Hikozaemon", "Hirohisa", "Hirotsugu", "Hisahsi", 
                    "Hisamitsu", "Hitomaro", "Honzo", "Ichiro", "Ietsuna", "Ikku", "Isao", "Iwane", "Izumo", "Juichi", 
                    "Junnosuke", "Jurobei", "Kakuei", "Kamlyn", "Kan", "Kanjiro", "Kannon", "Katai", "Katsuyuki", 
                    "Kawanari", "Kazuko", "Keitaro", "Kenjiro", "Kentaro", "Kichibei", "Kin", "Kinji", "Kinnosuke", 
                    "Kioshi", "Kiyoshi", "Koan", "Koichi", "Kojiro", "Konyo", "Korechika", "Kotaro", "Koyo", "Kozue", 
                    "Kuniaki", "Kunimichi", "Kunisada", "Kuniyoshi", "Kyoden", "Kyoichi", "Kyuichi", "Manobu", "Mareo", 
                    "Maro", "Masujiro", "Matsudaira", "Matsusuke", "Meiji", "Mieko", "Morimasa", "Moronobu", "Motoichi", 
                    "Motoyuki", "Natsuo", "Ninsei", "Niou", "Noboru", "Nobuharu", "Norihisa", "Oniji", "Orinosuke", 
                    "Reijiro", "Rikyu", "Rintaro", "Roka", "Roku", "Ryu", "Ryushi", "Ryutaro", "Sadahige", "Sadanobu", 
                    "Saemon", "Saikaku", "Sanetomo", "Satoru", "Sawao", "Seiho", "Seiichi", "Seiji", "Seinosuke", 
                    "Seishisai", "Shimpei", "Shinsaku", "Shirai", "Shosuke", "Shozaburo", "Shumei", "Shunji", "Shusui", 
                    "Sorai", "Sosa", "Sotaro", "Sugita", "Suketsune", "Susumu", "Tadahisa", "Tadashi", "Tadayoshi", 
                    "Tadayuki", "Takahiro", "Takanori", "Takao", "Takehide", "Takeji", "Tamotsu", "Tanak", "Tanosuke", 
                    "Tanzan", "Taro", "Tashiaki", "Tashiro", "Tasuku", "Tatsuya", "Tatsuzo", "Taysuke", "Teiji", 
                    "Terumoto", "Tetsuzan", "Tokaji", "Toki", "Tokimasa", "Tomiichi", "Toru", "Toshiaki", "Toshiharu", 
                    "Toshinobu", "Toyoharu", "Toyotomi", "Toyozo", "Tsugiharu", "Tsuginori", "Tsumemasa", "Ukyo", 
                    "Utaemon", "Yaichiro", "Yajirobei", "Yakumo", "Yamato", "Yasuhide", "Yasukazu", "Yatsuhiro", "Yosai", 
                    "Yoshifusa", "Yoshihide", "Yoshinobu", "Yozo", "Yujiro", "Zenko", "Zeshin"
                ],
                "last": [
                    "Adachi", "Ametsuchi", "Aoi", "Aomine", "Aoyama", "Aozora", "Arashiro", "Asari", "Ayuzawa", "Ban", 
                    "Banno", "Chikae", "Chinen", "Chino", "Demura", "Domen", "Ebisawa", "Enatsu", "Fujino", "Fukui", 
                    "Furukawa", "Furuya", "Gima", "Hamada", "Hanamura", "Harada", "Hatanaka", "Hattori", "Hirota", 
                    "Hoshino", "Ichinomiya", "Inouye", "Iori", "Ishihara", "Ishikawa", "Ito", "Itoh", "Iwasaki", 
                    "Iwayama", "Jinnouchi", "Kagawa", "Kai", "Kajiwara", "Kamenashi", "Kaneda", "Kanemaru", "Kanemoto", 
                    "Karasu", "Kashiwa", "Kawahara", "Kawashima", "Kaya", "Kibe", "Kikuchi", "Kinoshita", "Kiya", 
                    "Koga", "Kogane", "Koike", "Kojima", "Koki", "Kondo", "Konishi", "Konuma", "Koyasu", "Kudo", 
                    "Kugimiya", "Kure", "Kurisu", "Kuroki", "Machi", "Mano", "Maruyama", "Mase", "Matsuno", 
                    "Matsushita", "Mihara", "Mita", "Mitsugu", "Mizuno", "Mochizuki", "Moriai", "Morino", "Mukai", 
                    "Muraoka", "Nagaoka", "Nagatsuka", "Naito", "Nakanishi", "Nakata", "Natsukawa", "Nii", "Nishi", 
                    "No", "Oe", "Ogasawara", "Ohara", "Ohashi", "Okabe", "Okamoto", "Okamura", "Okimoto", 
                    "Ritsushima", "Rokuda", "Sako", "Sanda", "Sano", "Sasagawa", "Sasori", "Sazama", "Seki", 
                    "Sekiguchi", "Sera", "Shimamura", "Shimoda", "Shiraki", "Soga", "Sugai", "Sugihara", "Sumisu", 
                    "Tabata", "Tada", "Tahara", "Taira", "Tajima", "Takagaki", "Takahashi", "Takamoto", "Tamaasa", 
                    "Tamai", "Tamanaha", "Tamura", "Tanaka", "Tanimoto", "Tashiro", "Tatewaki", "Tatsuda", "Terada", 
                    "Teramoto", "Teruya", "Togoshi", "Tokugawa", "Toma", "Tomatsu", "Tomita", "Tsuda", "Tsukiyama", 
                    "Tsukuda", "Tsunoi", "Tsutsui", "Ueshiba", "Ueyama", "Umebayashi", "Uozumi", "Uramoto", "Urayama", 
                    "Uyeno", "Wada", "Wakao", "Wakata", "Wakayama", "Watanuki", "Watari", "Yamaji", "Yamanishi", 
                    "Yamasaki", "Yamasato", "Yamashita", "Yashima", "Yoichi", "Yokoi", "Yomaura", "Yonamine", 
                    "Yoneno", "Yonezawa", "Yoshigahara", "Yoshihama", "Yoshinaga", "Yoshitaka", "Yoshiya", "Yukimori", 
                    "Yumoto"
                ]
            },
            "female": {
                "first": [
                    "Abi", "Aira", "Aisa", "Akira", "Akko", "Ako", "Anda", "Aneka", "Aneko", "Ao", "Aoi", "Au", "Ayao", 
                    "Azami", "Azumi", "Chieko", "Chigusa", "Chiharu", "Chihiro", "Chihoko", "Chihomi", "Chika", "Chima", 
                    "Chimaki", "Chimako", "Chimari", "Chino", "Chiyo", "Eari", "Eiko", "Eire", "Eme", "Emiko", "Emio", 
                    "En", "Ena", "Etsu", "Fuji", "Fujiko", "Fukuko", "Fusa", "Fuuko", "Fuyu", "Ginko", "Hairi", "Hami", 
                    "Han", "Harukichi", "Hasumi", "Hatomi", "Hatsu", "Hatsumi", "Hatsuyo", "Hina", "Hirari", "Hisa", 
                    "Hona", "Honomi", "Hoshi", "Hoshie", "Hozumi", "Ichiko", "Ikoi", "Ikuko", "Ino", "Inoue", "Isa", 
                    "Isoko", "Ito", "Jin", "Jun", "June", "Kadiri", "Kai", "Kame", "Kameko", "Kami", "Kane", "Kaori", 
                    "Karin", "Kasumi", "Kaya", "Kayu", "Kiho", "Kikyo", "Kimie", "Kino", "Kioko", "Kioshi", "Kirari", 
                    "Kiwa", "Kohana", "Kome", "Koto", "Kumiyo", "Kunie", "Machiko", "Matsu", "Mayumi", "Megumi", 
                    "Midori", "Miho", "Mihoko", "Mino", "Misao", "Mitsu", "Miu", "Miwako", "Miyoko", "Mizuki", "Momoko", 
                    "Muika", "Naho", "Nahoko", "Nanako", "Nao", "Norie", "Ogi", "Orika", "Orimi", "Osen", "Raku", "Reiko", 
                    "Reina", "Reisa", "Rii", "Rika", "Rinako", "Ringo", "Rio", "Rui", "Ruka", "Ruma", "Rumiko", "Runa", 
                    "Ryu", "Sako", "Sawako", "Shino", "Shiori", "Shirushi", "Shungiku", "Sui", "Sumi", "Suzu", "Suzue", 
                    "Suzume", "Tadako", "Tai", "Taji", "Taki", "Tani", "Tatsu", "Taya", "Tokiyo", "Tomiju", "Tori", 
                    "Toshiko", "Tsukiko", "Tsuna", "Ume", "Umeka", "Usami", "Utako", "Utzuki", "Wakano", "Warabi", 
                    "Yoko", "Yori", "Yoshi", "Yoshike", "You", "Yu", "Yuki", "Yukika", "Yukiyo", "Yumi", "Yumia", "Yura"
                ],
                "last": [
                    "Adachi", "Aguni", "Akahoshi", "Akibara", "Akiya", "Amachi", "Aoyama", "Arakawa", "Arashi", "Araya", 
                    "Asari", "Ayuzawa", "Chijimatsu", "Chino", "Egusa", "Enatsu", "Endo", "Fukuhara", "Fukuizumi", 
                    "Furukawa", "Gamo", "Gomi", "Goya", "Hakuryū", "Hamano", "Hano", "Haruno", "Hashi", "Hattori", 
                    "Hiraoka", "Hirose", "Hoga", "Horiuchi", "Ichioka", "Ikeda", "Ikehara", "Ikehata", "Inoshishi", 
                    "Inouye", "Isayama", "Iseri", "Ishibashi", "Ishikura", "Iwata", "Kaba", "Kagiyama", "Kamata", 
                    "Kanda", "Kaneda", "Kaneko", "Kataoka", "Kato", "Kimoto", "Kinjo", "Kitamura", "Kiya", "Kiyabu", 
                    "Kobayashi", "Koki", "Kondo", "Konishi", "Kozato", "Kozutsami", "Kudo", "Kumagai", "Kunieda", 
                    "Kurata", "Kuroba", "Kurosawa", "Makino", "Mano", "Masaki", "Mase", "Matsuda", "Matsui", "Matsuno", 
                    "Matsuoka", "Mawatari", "Minamoto", "Mitsue", "Mitsugi", "Miyahira", "Miyake", "Miyano", "Miyashiro", 
                    "Mizuno", "Mori", "Morimoto", "Morishita", "Muratagi", "Murayama", "Naegi", "Nagai", "Nagano", 
                    "Nakagome", "Nakahara", "Nakai", "Nakajima", "Nakamura", "Nakanishi", "Nakano", "Nakata", "Namba", 
                    "Naru", "Nishimura", "Noguchi", "Nonaka", "Oba", "Oishi", "Okubo", "Okuyama", "Orio", "Orito", 
                    "Osaki", "Otani", "Otsuka", "Ozawa", "Rai", "Ritsushima", "Rokuda", "Ryūzaki", "Saionji", "Sakai", 
                    "Sasagawa", "Sawaya", "Saza", "Seno", "Seta", "Shibuya", "Shimada", "Shinkai", "Soda", "Sone", 
                    "Sugihara", "Sugimoto", "Takagi", "Takahashi", "Takakuwa", "Taketa", "Tamatsuki", "Tanikawa", 
                    "Tanji", "Tashiro", "Tatsuno", "Toda", "Tokunaga", "Tominaga", "Toyoda", "Tsujihara", "Tsukamoto", 
                    "Uchimura", "Ueno", "Uesato", "Ueto", "Ueyama", "Ueyonabaru", "Umemoto", "Wakasugi", "Wakino", 
                    "Wakisaka", "Yada", "Yaguchi", "Yahiro", "Yamada", "Yamaha", "Yamanami", "Yamashina", "Yanagimoto", 
                    "Yanagisawa", "Yanase", "Yashiro", "Yasumoto", "Yasutake", "Yodogawa", "Yokota", "Yoshihisa", 
                    "Yoshii", "Yoshitaka", "Yuhara", "Yukimuro", "Yumoto", "Zayasu"
                ]
            }
        }
    }
}