%YAML 1.1
%TAG !u! tag:unity3d.com,2011:
--- !u!114 &11400000
MonoBehaviour:
  m_ObjectHideFlags: 0
  m_CorrespondingSourceObject: {fileID: 0}
  m_PrefabInstance: {fileID: 0}
  m_PrefabAsset: {fileID: 0}
  m_GameObject: {fileID: 0}
  m_Enabled: 1
  m_EditorHideFlags: 0
  m_Script: {fileID: 11500000, guid: a79c9c8a8609bbb4591197163e73c2f8, type: 3}
  m_Name: "Hostinsk\xFD"
  m_EditorClassIdentifier: 
  manaCost: -2
  cardName: "Hostinsk\xFD"
  cardDescription: "P\u0159i vylo\u017Een\xED zni\u010D\xED v\u0161echny tvoje karty
    na boji\u0161ti"
  cardSprite: {fileID: 21300000, guid: 127afe8708b443f4dbb7fc60776ffb4b, type: 3}
  health: 1
  damage: 0
  onUseEffects:
  - {fileID: 11400000, guid: e2eab2228c7693040ac910e1f45224b4, type: 2}
  onStartTurnEffects: []
  onDeathEffects: []
  afterTurnEffects: []
