%YAML 1.1
%TAG !u! tag:unity3d.com,2011:
--- !u!114 &11400000
MonoBehaviour:
  m_ObjectHideFlags: 0
  m_CorrespondingSourceObject: {fileID: 0}
  m_PrefabInstance: {fileID: 0}
  m_PrefabAsset: {fileID: 0}
  m_GameObject: {fileID: 0}
  m_Enabled: 1
  m_EditorHideFlags: 0
  m_Script: {fileID: 11500000, guid: e0268bdc1baf48b429d0a02764a4c2ab, type: 3}
  m_Name: AttackIntro
  m_EditorClassIdentifier: 
  monologues:
  - speakerName: Bratr
    sequence: "No a samoz\u0159ejm\u011B po ukon\u010Den\xED tahu na sebe povolan\xE9
      bytosti naproti sob\u011B \xFAto\u010D\xED. Ale to ur\u010Dit\u011B v\xED\u0161,
      kdy\u017E m\u011B tak p\u0159eru\u0161uje\u0161\u2026\r"
  - speakerName: "Medv\u011Bd"
    sequence: "Jasn\xFD! Stejn\u011B tak v\xEDm, \u017Ee krystal ti zni\u010D\xEDm
      bytostma, kter\xFD proti sob\u011B nemaj protivn\xEDka a uberou tv\xFDmu krystalu
      p\u0159\xEDslu\u0161nej po\u010Det \u017Eivot\u016F.\r"
  - speakerName: Bratr
    sequence: "T\u011B\u0161 se, zni\u010D\xEDm t\u011B! \r"
  - speakerName: "Medv\u011Bd"
    sequence: "Leda bobek!\r"
  delayPerSymbol: 0
  availableChoices: []
