%YAML 1.1
%TAG !u! tag:unity3d.com,2011:
--- !u!114 &11400000
MonoBehaviour:
  m_ObjectHideFlags: 0
  m_CorrespondingSourceObject: {fileID: 0}
  m_PrefabInstance: {fileID: 0}
  m_PrefabAsset: {fileID: 0}
  m_GameObject: {fileID: 0}
  m_Enabled: 1
  m_EditorHideFlags: 0
  m_Script: {fileID: 11500000, guid: a79c9c8a8609bbb4591197163e73c2f8, type: 3}
  m_Name: "Sil\xE1k"
  m_EditorClassIdentifier: 
  manaCost: 3
  cardName: "Sil\xE1k"
  cardDescription: 
  cardSprite: {fileID: 21300000, guid: 0460375b8cfd5b449828b568fcb2eefc, type: 3}
  health: 1
  damage: 5
  onUseEffects: []
  onStartTurnEffects: []
  onDeathEffects: []
  afterTurnEffects: []
