%YAML 1.1
%TAG !u! tag:unity3d.com,2011:
--- !u!114 &11400000
MonoBehaviour:
  m_ObjectHideFlags: 0
  m_CorrespondingSourceObject: {fileID: 0}
  m_PrefabInstance: {fileID: 0}
  m_PrefabAsset: {fileID: 0}
  m_GameObject: {fileID: 0}
  m_Enabled: 1
  m_EditorHideFlags: 0
  m_Script: {fileID: 11500000, guid: a79c9c8a8609bbb4591197163e73c2f8, type: 3}
  m_Name: 5-5
  m_EditorClassIdentifier: 
  manaCost: 5
  cardName: Taky Jirka
  cardDescription: 
  cardSprite: {fileID: 21300000, guid: 64d753a4b2a74f945adb3c956df69fc7, type: 3}
  health: 6
  damage: 6
  onUseEffects: []
  onStartTurnEffects: []
  onDeathEffects: []
  afterTurnEffects: []
