"index","vertices","edges","min degree","max degree","median degree","avg degree","connectivity"
1,10,11,0,5,3,2.2,0
3,20,73,1,15,8,7.3,1
5,20,97,1,14,11,9.7,1
7,30,147,2,15,11,9.8,2
9,30,175,6,19,12,11.6667,6
11,30,291,8,26,22,19.4,8
13,40,297,8,25,14,14.85,8
15,40,360,8,25,19,18,8
17,50,385,7,24,15,15.4,7
19,50,489,6,32,18,19.56,6
21,50,872,18,47,36,34.88,18
23,60,676,6,38,24,22.5333,6
25,60,1053,20,50,36,35.1,20
27,70,795,12,36,22,22.7143,12
29,70,1011,9,48,29,28.8857,9
31,70,1596,24,64,48,45.6,24
33,80,1348,8,58,36,33.7,8
35,80,1831,14,66,54,45.775,14
37,90,1330,7,51,29,29.5556,7
39,90,1456,9,54,32,32.3556,9
41,90,2319,20,71,60,51.5333,20
43,100,1624,17,52,31,32.48,17
45,100,1981,22,64,40,39.62,22
47,100,3274,38,96,68,65.48,38
49,113,1896,1,88,27,33.5575,1
51,120,2251,13,68,37,37.5167,13
53,120,2588,14,80,44,43.1333,14
55,120,3723,29,104,63,62.05,29
57,121,486,0,26,4,8.03306,0
59,121,2174,3,82,33,35.9339,1
61,129,613,0,39,4,9.50388,0
63,129,2476,0,79,41,38.3876,0
65,129,8112,56,128,127,125.767,56
67,139,2877,0,85,49,41.3957,0
69,140,2915,16,72,41,41.6429,16
71,140,4298,16,93,66,61.4,16
73,140,5137,41,116,75,73.3857,41
75,144,1191,0,50,7,16.5417,0
77,144,3089,0,75,72,42.9028,0
79,159,433,0,18,4,5.44654,0
81,159,3752,1,119,47,47.195,1
83,160,4259,8,94,52,53.2375,8
85,160,5705,34,108,75,71.3125,34
87,160,9200,59,143,121,115,59
89,171,1623,1,49,20,18.9825,1
91,180,4602,23,89,50,51.1333,23
93,180,6502,32,114,73,72.2444,32
95,180,7945,41,103,90,88.2778,41
97,184,468,0,20,4,5.08696,0
99,184,1367,1,53,14,14.8587,1
101,200,6731,24,122,65,67.31,24
103,200,7081,19,121,71,70.81,19
105,200,12309,66,171,121,123.09,66
107,204,632,0,83,5,6.19608,0
109,204,6212,0,161,66,60.902,0
111,204,12271,0,176,148,120.304,0
113,204,19608,52,203,198,192.235,52
115,211,1705,0,43,10,16.1611,0
117,211,6633,0,158,64,62.872,0
119,213,1826,0,55,4,17.1455,0
121,213,6773,18,141,63,63.5962,1
123,215,2070,0,52,16,19.2558,0
125,215,6896,6,119,53,64.1488,6
127,216,3070,0,59,34,28.4259,0
129,216,6964,1,127,70,64.4815,1
131,221,1091,0,36,8,9.8733,0
133,221,18291,19,218,179,165.529,19
135,232,3633,0,89,14,31.319,0
137,232,5578,0,99,27,48.0862,0
139,232,17300,42,213,166,149.138,42
141,250,1450,0,46,11,11.6,0
143,250,3813,0,86,23,30.504,0
145,250,6574,3,116,40,52.592,3
147,250,11421,21,181,92,91.368,21
149,250,22395,54,241,190,179.16,54
151,250,29867,135,249,245,238.936,135
153,250,31119,245,249,249,248.952,245
155,263,1295,0,36,4,9.84791,0
157,263,3422,0,106,22,26.0228,0
159,263,20837,1,210,193,158.456,1
161,279,2000,0,44,10,14.3369,0
163,279,5825,0,100,45,41.7563,0
165,279,24777,1,248,188,177.613,1
167,300,14191,28,168,93,94.6067,28
169,300,15456,29,188,105,103.04,29
171,300,25919,106,270,187,172.793,106
173,313,1764,0,49,5,11.2716,0
175,313,3516,0,54,20,22.4665,0
177,313,14634,29,200,94,93.508,29
179,330,1370,0,33,7,8.30303,0
181,330,3253,3,50,17,19.7152,3
183,330,5613,7,72,32,34.0182,7
185,347,1456,0,33,4,8.39193,0
187,347,7500,0,169,29,43.2277,0
189,347,31752,1,249,235,183.009,1
191,400,31201,39,274,158,156.005,39
193,400,42153,73,314,216,210.765,73
195,620,3992,0,63,9,12.8774,0
197,620,35188,13,327,109,113.51,13
199,620,163863,120,619,541,528.59,120
